FreeBSD-main-amd64-test - Build #29593 - Still Unstable

From: <jenkins-admin_at_FreeBSD.org>
Date: Wed, 30 Sep 2026 11:13:16 UTC
FreeBSD-main-amd64-test - Build #29593 (2127135a22e3f9eafa4ba4ca819d4971b6e27125) - Still Unstable

Build information: https://ci.FreeBSD.org/job/FreeBSD-main-amd64-test/29593/
Full change log: https://ci.FreeBSD.org/job/FreeBSD-main-amd64-test/29593/changes
Full build log: https://ci.FreeBSD.org/job/FreeBSD-main-amd64-test/29593/console

Status explanation:
"Unstable" - some tests are suspected being broken by the following changes
"Still Unstable" - the failing test cases have not been fixed by these
                   following changes and this is a notification to note that
                   these changes have not been fully tested by the CI system

Change summaries:
(Those commits are likely but not certainly responsible)

afe41f1ab9f6cbabf43f28446a61ed3fe1cd72a7 by brooks:
sys/uio: add updateiov()

2127135a22e3f9eafa4ba4ca819d4971b6e27125 by brooks:
jail_{get,set}: user_ implementations



The failed test cases:

9 tests failed.
FAILED:  sys.netpfil.pf.pflog.rdr_action

Error Message:
atf-check failed; see the output of the test for details

FAILED:  sys.netpfil.pf.syncookie.basic_v6

Error Message:
Failed to connect to syncookie protected echo daemon

FAILED:  sys.kern.ssl_sendfile.truncate

Error Message:
Test case body timed out

FAILED:  sys.netpfil.pf.pfsync.bulk

Error Message:
state not found on synced host

FAILED:  sys.kern.ssl_sendfile.eagain_vs_eof

Error Message:
/usr/src/tests/sys/kern/ssl_sendfile.c:485: c.sbytes == -1 not met

FAILED:  lib.libexecinfo.sigtramp_test.test_backtrace_sigtramp

Error Message:
/usr/src/lib/libexecinfo/tests/sigtramp_test.c:30: n > 1 not met

FAILED:  sys.net.if_lagg_test.witness

Error Message:
Lock-order reversals involving if_lagg.c detected

FAILED:  sys.netinet.udp_bindings.connect_bound_socket_from_2address_jail

Error Message:
/usr/src/tests/sys/netinet/udp_bindings.c:244: connect(s, (struct sockaddr *)&sin, sizeof(sin)) == 0 not met

FAILED:  sys.netlink.netlink_socket.overflow

Error Message:
/usr/src/tests/sys/netlink/netlink_socket.c:146: send(fd, &hdr, sizeof(hdr), 0) == sizeof(hdr) not met