FreeBSD-main-amd64-test - Build #29592 - Still Unstable
Date: Wed, 30 Sep 2026 08:23:46 UTC
FreeBSD-main-amd64-test - Build #29592 (52b2056849e4f77581594b9ca21ac3feb60429c3) - Still Unstable
Build information: https://ci.FreeBSD.org/job/FreeBSD-main-amd64-test/29592/
Full change log: https://ci.FreeBSD.org/job/FreeBSD-main-amd64-test/29592/changes
Full build log: https://ci.FreeBSD.org/job/FreeBSD-main-amd64-test/29592/console
Status explanation:
"Unstable" - some tests are suspected being broken by the following changes
"Still Unstable" - the failing test cases have not been fixed by these
following changes and this is a notification to note that
these changes have not been fully tested by the CI system
Change summaries:
(Those commits are likely but not certainly responsible)
7c5dd794f2cc6c5ba2675cfc451308dd493b078e by markj:
sysvsem: Fix another sequence number wraparound race
4ba0c0c4887d0e648b3b6d4002e96c6630e72137 by markj:
kqueue: Fix handling of marker knotes during fork
5804ea3da21096f7c1707799e918b4eb592838be by markj:
kqueue: Fix a potential OOB access in kqueue_fork_copy_knote()
e4a57ef30c2f000b844e553f41e39ce46eff8cdd by markj:
file: Add a helper function to check whether filecaps are full
dfc979fb8e210b565c4e291b6e67205733b6e663 by markj:
file: Add filecaps_intersect() and cap_rights_intersect()
047562735bc9bc4587519e2287106a3294ce6505 by markj:
fdescfs: Pass up additional metadata during lookups
9c10f4c021ddd272ec4352412cf75880424bc70c by markj:
vfs: Disallow renameat() with FD_RESOLVE_BENEATH descriptors
52b2056849e4f77581594b9ca21ac3feb60429c3 by markj:
openssl: Fix CVE-2026-84782
The failed test cases:
9 tests failed.
FAILED: sys.netpfil.pf.syncookie.basic_v6
Error Message:
Failed to connect to syncookie protected echo daemon
FAILED: sys.kern.ssl_sendfile.truncate
Error Message:
Test case body timed out
FAILED: sys.netpfil.pf.pfsync.bulk
Error Message:
state not found on synced host
FAILED: sys.kern.ssl_sendfile.eagain_vs_eof
Error Message:
/usr/src/tests/sys/kern/ssl_sendfile.c:485: c.sbytes == -1 not met
FAILED: lib.libexecinfo.sigtramp_test.test_backtrace_sigtramp
Error Message:
/usr/src/lib/libexecinfo/tests/sigtramp_test.c:30: n > 1 not met
FAILED: sys.kern.ssl_sendfile.grow
Error Message:
Test case body timed out
FAILED: sys.net.if_lagg_test.witness
Error Message:
Lock-order reversals involving if_lagg.c detected
FAILED: sys.netinet.udp_bindings.connect_bound_socket_from_2address_jail
Error Message:
/usr/src/tests/sys/netinet/udp_bindings.c:244: connect(s, (struct sockaddr *)&sin, sizeof(sin)) == 0 not met
FAILED: sys.netlink.netlink_socket.overflow
Error Message:
/usr/src/tests/sys/netlink/netlink_socket.c:146: send(fd, &hdr, sizeof(hdr), 0) == sizeof(hdr) not met