FreeBSD-main-amd64-test - Build #29594 - Still Unstable

From: <jenkins-admin_at_FreeBSD.org>
Date: Wed, 30 Sep 2026 14:07:04 UTC
FreeBSD-main-amd64-test - Build #29594 (f11af6535044c8266d52806d72b07e939f94049c) - Still Unstable

Build information: https://ci.FreeBSD.org/job/FreeBSD-main-amd64-test/29594/
Full change log: https://ci.FreeBSD.org/job/FreeBSD-main-amd64-test/29594/changes
Full build log: https://ci.FreeBSD.org/job/FreeBSD-main-amd64-test/29594/console

Status explanation:
"Unstable" - some tests are suspected being broken by the following changes
"Still Unstable" - the failing test cases have not been fixed by these
                   following changes and this is a notification to note that
                   these changes have not been fully tested by the CI system

Change summaries:
(Those commits are likely but not certainly responsible)

10729d0ce11c9ac5077d158bb372f9c39053f168 by markj:
net: Fix handling of sockaddrs in the SIOC{ADD,DEL}MULTI handlers

f15642e24db7d16c63ce484924d9075926dbf58a by markj:
imgact_aout: Widen the overflow checks in exec_aout_imgact()

57f9bad9188d70272c131a6cc8502d00be58fd56 by rcm:
pf: deregister the ifnet_rename_event handler on unload

123342f3d2cccf432d3d0082097b6c97397ecc67 by markj:
igmp: Deindent some code

dc47a6940d60d393b3d36ba0fc5cb84d06fafaea by markj:
igmp: Refresh the ip header pointer after m_pullup()

629c7cf72dd82d6f11dbc67a405417b4a643c000 by wosch:
bsd-family-tree: add macOS 27

3c58e64369fd8124c83f1c7d63106bddca83fa1e by kp:
pf: set the correct type for rule timeouts

3893050bc1000d92c4a68d6954ff27e1aa5ecf76 by markj:
riscv: Fix the bus_space_read_stream_8 macro

c4640126f1160c3eb939aa138445f4b4ea98efb0 by kgalazka:
loader.efi: Apply command-line DHCP overrides earlier

48b29e9e54c592767fa363237e9837c90c8d7ccd by kgalazka:
loader.efi: Retain standalone network configuration

eaba5142bdefd6b5b249793f6f8ec3528afb12e3 by rcm:
pf: carry pfra_fback in the netlink pfr_addr encoding

da0764f23554ef446003b5f2ab4e535a3329b0ab by markj:
vm_swapout: Restore handling of RLIMIT_RSS

cc467e45136d2f562f654ff6f4f9b91ee9767b0f by kib:
amd64/mp_machdep.c: remove double 'for' in comment

233b6efe5f2f2af799a854745e79cce35893c166 by kib:
pdfork.2: downgrade sections inside description to subsections

18e9f60602c43c85a65446568206b73fba55c286 by olivier:
tests/fdescfs: skip when module is missing

669cd0d90ee7b5bed794ded5fa00b6be854a6598 by markj:
rge: Preserve replacement mbufs after defragmentation

f3d6bce1be4f4d383144f00853a3dd3a39306557 by olivier:
tests/zonectl: skip when geom_zoned module is missing

767cd9bb420008a3ebeef65fe1d31eab60d61028 by markj:
vm_swapout: Fix the build without options RACCT

c4e25d192f82f5579c14c764187b0e20703ebe3d by ziaee:
umodem.4: Canonicalize SYNOPSIS + tag SPDX

dc20c58ae58e9cc5e711338d74deeb591f00c6c6 by ziaee:
umoscom.4: Canonicalize SYNOPSIS + tag SPDX

bfe327329929809f9999b0d734c359d895424044 by ziaee:
ums.4: Canonicalize SYNOPSIS + tag SPDX

afe3e2e9c5d573b490b42b9ee2f5e11611ee8b50 by ziaee:
unionfs.4: Canonicalize SYNOPSIS + nit SPDX

5990a88892c5003ce5ec160f261e70ea8bfe510b by olivier:
tests/geom: fix ATF test listing when geom class module is missing

ec8b68ba8a4ad3b020805322f7c676869978a480 by markj:
amd64: Revert an unintended change to GENERIC

cc5c384a3476c6d87cb6169e9494b56a261713ac by philip:
Import tzdata 2026e



The failed test cases:

11 tests failed.
FAILED:  sys.fs.fusefs.ctl.remove_lun_with_atime

Error Message:
atf-check failed; see the output of the test for details

FAILED:  sys.kern.ssl_sendfile.grow

Error Message:
Test case body timed out

FAILED:  sys.net.if_tun_test.basic

Error Message:
atf-check failed; see the output of the test for details

FAILED:  sys.netpfil.pf.pflog.rdr_action

Error Message:
atf-check failed; see the output of the test for details

FAILED:  sys.netpfil.pf.syncookie.basic_v6

Error Message:
Failed to connect to syncookie protected echo daemon

FAILED:  sys.kern.ssl_sendfile.truncate

Error Message:
Test case body timed out

FAILED:  sys.netpfil.pf.pfsync.bulk

Error Message:
state not found on synced host

FAILED:  lib.libexecinfo.sigtramp_test.test_backtrace_sigtramp

Error Message:
/usr/src/lib/libexecinfo/tests/sigtramp_test.c:30: n > 1 not met

FAILED:  sys.net.if_lagg_test.witness

Error Message:
Lock-order reversals involving if_lagg.c detected

FAILED:  sys.netinet.udp_bindings.connect_bound_socket_from_2address_jail

Error Message:
/usr/src/tests/sys/netinet/udp_bindings.c:244: connect(s, (struct sockaddr *)&sin, sizeof(sin)) == 0 not met

FAILED:  sys.netlink.netlink_socket.overflow

Error Message:
/usr/src/tests/sys/netlink/netlink_socket.c:146: send(fd, &hdr, sizeof(hdr), 0) == sizeof(hdr) not met