FreeBSD-main-amd64-test - Build #29589 - Still Unstable

From: <jenkins-admin_at_FreeBSD.org>
Date: Wed, 30 Sep 2026 00:12:25 UTC
FreeBSD-main-amd64-test - Build #29589 (081f751823aa90d8cfea53e900f81dff7cc9836b) - Still Unstable

Build information: https://ci.FreeBSD.org/job/FreeBSD-main-amd64-test/29589/
Full change log: https://ci.FreeBSD.org/job/FreeBSD-main-amd64-test/29589/changes
Full build log: https://ci.FreeBSD.org/job/FreeBSD-main-amd64-test/29589/console

Status explanation:
"Unstable" - some tests are suspected being broken by the following changes
"Still Unstable" - the failing test cases have not been fixed by these
                   following changes and this is a notification to note that
                   these changes have not been fully tested by the CI system

Change summaries:
(Those commits are likely but not certainly responsible)

081f751823aa90d8cfea53e900f81dff7cc9836b by pkubaj:
stand/powerpc/ofw: do not truncate device tree properties to 1024 bytes



The failed test cases:

55 tests failed.
FAILED:  sys.net.if_tun_test.basic

Error Message:
atf-check failed; see the output of the test for details

FAILED:  lib.libbe.be_create.libbe_create

Error Message:
atf-check failed; see the output of the test for details

FAILED:  sbin.bectl.bectl_test.bectl_create

Error Message:
atf-check failed; see the output of the test for details

FAILED:  sbin.bectl.bectl_test.bectl_destroy

Error Message:
atf-check failed; see the output of the test for details

FAILED:  sbin.bectl.bectl_test.bectl_destroy_bootonce

Error Message:
atf-check failed; see the output of the test for details

FAILED:  sbin.bectl.bectl_test.bectl_export_import

Error Message:
atf-check failed; see the output of the test for details

FAILED:  sbin.bectl.bectl_test.bectl_jail

Error Message:
atf-check failed; see the output of the test for details

FAILED:  sbin.bectl.bectl_test.bectl_list

Error Message:
atf-check failed; see the output of the test for details

FAILED:  sbin.bectl.bectl_test.bectl_mount

Error Message:
atf-check failed; see the output of the test for details

FAILED:  sbin.bectl.bectl_test.bectl_promotion

Error Message:
atf-check failed; see the output of the test for details

FAILED:  sbin.bectl.bectl_test.bectl_rename

Error Message:
atf-check failed; see the output of the test for details

FAILED:  sbin.bectl.bectl_test.bectl_rename_bootonce

Error Message:
atf-check failed; see the output of the test for details

FAILED:  sys.acl.01.main

Error Message:
Bailed out

FAILED:  sys.acl.03.main

Error Message:
Bailed out

FAILED:  sys.acl.04.main

Error Message:
Bailed out

FAILED:  sys.aio.aio_test.vectored_unaligned

Error Message:
/usr/src/tests/sys/aio/aio_test.c:1001: 0 != system(cmd): zpool create failed: No error: 0

FAILED:  sys.aio.aio_test.vectored_zvol_poll

Error Message:
/usr/src/tests/sys/aio/aio_test.c:1001: 0 != system(cmd): zpool create failed: No error: 0

FAILED:  sys.fs.pjdfstest.zfs.zfs

Error Message:
atf-check failed; see the output of the test for details

FAILED:  sys.fs.pjdfstest.zfs.zfs_nullfs

Error Message:
atf-check failed; see the output of the test for details

FAILED:  sys.netpfil.pf.pfsync.bulk

Error Message:
state not found on synced host

FAILED:  sys.netpfil.pf.syncookie.basic_v6

Error Message:
Failed to connect to syncookie protected echo daemon

FAILED:  usr.sbin.makefs.makefs_zfs_tests.T_flag_F_flag

Error Message:
atf-check failed; see the output of the test for details

FAILED:  usr.sbin.makefs.makefs_zfs_tests.T_flag_dir

Error Message:
atf-check failed; see the output of the test for details

FAILED:  usr.sbin.makefs.makefs_zfs_tests.T_flag_mtree

Error Message:
atf-check failed; see the output of the test for details

FAILED:  usr.sbin.makefs.makefs_zfs_tests.autoexpand

Error Message:
atf-check failed; see the output of the test for details

FAILED:  usr.sbin.makefs.makefs_zfs_tests.basic

Error Message:
atf-check failed; see the output of the test for details

FAILED:  usr.sbin.makefs.makefs_zfs_tests.compression

Error Message:
atf-check failed; see the output of the test for details

FAILED:  usr.sbin.makefs.makefs_zfs_tests.dataset_removal

Error Message:
atf-check failed; see the output of the test for details

FAILED:  usr.sbin.makefs.makefs_zfs_tests.devfs

Error Message:
atf-check failed; see the output of the test for details

FAILED:  usr.sbin.makefs.makefs_zfs_tests.empty_dir

Error Message:
atf-check failed; see the output of the test for details

FAILED:  usr.sbin.makefs.makefs_zfs_tests.empty_fs

Error Message:
atf-check failed; see the output of the test for details

FAILED:  usr.sbin.makefs.makefs_zfs_tests.file_extend

Error Message:
atf-check failed; see the output of the test for details

FAILED:  usr.sbin.makefs.makefs_zfs_tests.file_sizes

Error Message:
atf-check failed; see the output of the test for details

FAILED:  usr.sbin.makefs.makefs_zfs_tests.hard_links

Error Message:
atf-check failed; see the output of the test for details

FAILED:  usr.sbin.makefs.makefs_zfs_tests.indirect_dnode_array

Error Message:
atf-check failed; see the output of the test for details

FAILED:  usr.sbin.makefs.makefs_zfs_tests.long_file_name

Error Message:
atf-check failed; see the output of the test for details

FAILED:  usr.sbin.makefs.makefs_zfs_tests.multi_dataset_1

Error Message:
atf-check failed; see the output of the test for details

FAILED:  usr.sbin.makefs.makefs_zfs_tests.multi_dataset_2

Error Message:
atf-check failed; see the output of the test for details

FAILED:  usr.sbin.makefs.makefs_zfs_tests.multi_dataset_3

Error Message:
atf-check failed; see the output of the test for details

FAILED:  usr.sbin.makefs.makefs_zfs_tests.multi_dataset_4

Error Message:
atf-check failed; see the output of the test for details

FAILED:  usr.sbin.makefs.makefs_zfs_tests.multi_dataset_5

Error Message:
atf-check failed; see the output of the test for details

FAILED:  usr.sbin.makefs.makefs_zfs_tests.multi_staging_1

Error Message:
atf-check failed; see the output of the test for details

FAILED:  usr.sbin.makefs.makefs_zfs_tests.multi_staging_2

Error Message:
atf-check failed; see the output of the test for details

FAILED:  usr.sbin.makefs.makefs_zfs_tests.path_vdev_props

Error Message:
atf-check failed; see the output of the test for details

FAILED:  usr.sbin.makefs.makefs_zfs_tests.perms

Error Message:
atf-check failed; see the output of the test for details

FAILED:  usr.sbin.makefs.makefs_zfs_tests.root_props

Error Message:
atf-check failed; see the output of the test for details

FAILED:  usr.sbin.makefs.makefs_zfs_tests.snapshot

Error Message:
atf-check failed; see the output of the test for details

FAILED:  usr.sbin.makefs.makefs_zfs_tests.soft_links

Error Message:
atf-check failed; see the output of the test for details

FAILED:  usr.sbin.makefs.makefs_zfs_tests.used_space_props

Error Message:
atf-check failed; see the output of the test for details

FAILED:  sys.kern.ssl_sendfile.eagain_vs_eof

Error Message:
/usr/src/tests/sys/kern/ssl_sendfile.c:485: c.sbytes == -1 not met

FAILED:  lib.libexecinfo.sigtramp_test.test_backtrace_sigtramp

Error Message:
/usr/src/lib/libexecinfo/tests/sigtramp_test.c:30: n > 1 not met

FAILED:  sys.kern.ssl_sendfile.grow

Error Message:
Test case body timed out

FAILED:  sys.net.if_lagg_test.witness

Error Message:
Lock-order reversals involving if_lagg.c detected

FAILED:  sys.netinet.udp_bindings.connect_bound_socket_from_2address_jail

Error Message:
/usr/src/tests/sys/netinet/udp_bindings.c:244: connect(s, (struct sockaddr *)&sin, sizeof(sin)) == 0 not met

FAILED:  sys.netlink.netlink_socket.overflow

Error Message:
/usr/src/tests/sys/netlink/netlink_socket.c:146: send(fd, &hdr, sizeof(hdr), 0) == sizeof(hdr) not met