FreeBSD-main-amd64-test - Build #29588 - Still Unstable
Date: Tue, 29 Sep 2026 21:25:19 UTC
FreeBSD-main-amd64-test - Build #29588 (34f9f5680c9d5d5138e427ba3aeab0138cec3882) - Still Unstable
Build information: https://ci.FreeBSD.org/job/FreeBSD-main-amd64-test/29588/
Full change log: https://ci.FreeBSD.org/job/FreeBSD-main-amd64-test/29588/changes
Full build log: https://ci.FreeBSD.org/job/FreeBSD-main-amd64-test/29588/console
Status explanation:
"Unstable" - some tests are suspected being broken by the following changes
"Still Unstable" - the failing test cases have not been fixed by these
following changes and this is a notification to note that
these changes have not been fully tested by the CI system
Change summaries:
(Those commits are likely but not certainly responsible)
994fb17039681298ef37576e12fd0bceac771470 by noreply:
Fix metaslab count assertion in metaslab_group_alloc() for small vdevs
1004b197bbb7871632bd379b6337f619468d1fad by behlendorf1:
uio: add zfs_uio_iov() accessor for uio_iov
3f58117021d531b25504d3e07fe0410ad11600be by behlendorf1:
linux/uio: don't require wrapped data to be const
008cd4505365fdd66a5e34d776314d32169b39d1 by behlendorf1:
zio_crypt: single field for mechname
67458871e8e9c099eb3058ed1dcf6c8e8696d15d by behlendorf1:
zio_crypt: add platform-specific headers
542327a8cb18fcbd37fa209b9ea06413a471f15e by behlendorf1:
zio_crypt: establish platform interface; rework common code to use it
1df943d8897bf091a6920a529e350a1fc3fd1cd4 by behlendorf1:
zio_crypt_os: implement platform interface for ICP
f704841016dbd425beb33c1e8c318f1520b7cdb3 by behlendorf1:
zio_crypt_os: implement platform interface for FreeBSD
7adc908d336e584db0fa254ba5ac5a5f14f746a7 by noreply:
build: Add gitrev as a dependency to specific targets that require it
04424a5c3429907bed4edfa0aad61fbe7a1e427c by noreply:
Suggest libtirpc-dev for Ubuntu builds
78f49e1ddbc241b20aaab4db28233013065702d0 by noreply:
vdev_disk: simplify alignment checks for linear ABDs
4148c229b963bee2cc47b03965276cfc04a2f08d by noreply:
build: Fix building kernel module when builddir is different from srcdir
c69f0e3a83a461afb1b8cbada70b0844d225b0c9 by noreply:
libzfs_core: block delivery of SIGUSR1 in send_worker thread
66ed6c239dbc729c975d64886a9a13afe807656d by behlendorf1:
build: Properly cache test results
a05edc8e696e9b56e37f57c664c779b3216f7bbf by behlendorf1:
build: Ensure build dir is created for kernel option compatibility check
9a4786517d8bf406d1eaba880a2c1454eb504909 by behlendorf1:
build: Cache build results of unchecked kernel tests
9388f24438203bdae7a45037e98ae0ef4521ed54 by behlendorf1:
build: Handle case where no kernel compile tests are necessary
44aa82a6ce91bc63bd83a1adccd31a8ea5460e73 by noreply:
linux: support the FS_IOC_GETFSUUID ioctl
fa4bc4dec733ffe307dd0f7ff79e7acabcc5ccf7 by noreply:
spa_errlog: don't let one unresolvable entry hide the whole error log
f5b2fc8e29e7801ec3cae4e64f24611750a2c7ec by noreply:
zfs_ctldir: make .zfs/snapshot/<name> btime the snapshot creation time
2dece2a348063e2f53fc59ba1dd574ea280f8f4e by noreply:
zstream: report invalid record context without assertions
3fcbafc80e75624c8995fb2ebea96613d0c49e97 by noreply:
Linux: copy whole multi-page bvecs at once
3a67db3143014ee3a2c2904cd26214c531293d03 by noreply:
Linux: skip hardened usercopy checks in zfs_uiomove_iter()
e903655c50fe2e710a4cdfe6e638454012ef6324 by noreply:
zpool: Add zpool status -vv error ranges
5b6906a5f5363970ae3e1da890ca762e75590078 by noreply:
ZTS: fix test-runner crashing immediately under -m
b6dde8a170ced591b6919eef592629b65da1761a by noreply:
zio_crypt: free the key unwrap uios when decryption fails
8e3e47c47bdef773a722bb28162a7a5965e98c0b by noreply:
ZTS: don't mistake a compiled-in kmemleak for a running one
c2108a3e4d66386a3ee873655811aceb0c9ebfdf by behlendorf1:
zdb: don't index an indirect vdev's metaslabs in the --class filter
db78d8b071fd0824090e022eec0f0f872f407125 by behlendorf1:
zdb: account pending DDT-log frees in leak detection
7636c39ec50f9c1a0e7318afd6ae4ca190826c33 by noreply:
rpm: Add support for building akmod packages
5d6ce30759356632d57b341ffcf59f619b70c16a by noreply:
ZTS: Make zpool_prefetch_001_pos faster
74c0810abacbe5c51883d78872bd07f20c534b06 by noreply:
ZTS: Change zpool_initialize_multiple_pools devsize
c00228df4666092be40b5a16870ad076ab6c609e by noreply:
CI: stop cloud-init stalling every Alpine boot
2f29d2598cabab086c58bec67a3fa424114b3158 by noreply:
ZTS: take the loop device name from losetup itself
f4192d6595fad0d11a120abf2bca2a71cecdec28 by noreply:
libzfs: explain why a large-block stream mismatch happens
f3bf5f96839f1cc9e393109a1426cc4c81e698a0 by noreply:
CI: install diffutils on the Alpine runner
88befe7428621b6d0bc04d2558ea9dadad0c699e by behlendorf1:
zfs_namecheck: reject '.' and '..' before a snapshot or bookmark
191a3939dbe3339d49191827fb60b72af864a768 by behlendorf1:
unit/namecheck: cover dot components before a delimiter
b6c59d159727acdc83987532a230c5ea115197f5 by behlendorf1:
ZTS/rsend: receive into a '.' or '..' component must fail
2eae71cd170134a34419874a9d307bb57c156935 by behlendorf1:
Aggregate dataset space accounting deltas over a txg
2f152b4112b183f7fb61552db41a8849ef2e55e0 by behlendorf1:
Avoid dd_lock in the open context space checks
718eaa65e8abe3f716156fb1956004db81078266 by noreply:
ZTS: look for the kmemleak file the way it is later used
6de242116f5a6c0f314dbbc42fd1493966521721 by noreply:
ZTS: zfs_get_006_neg: drop argument-ordering cases
0eb67bef32cd2266d9435ba546aac08aa9e12564 by noreply:
build: Fix AM_V_GEN usage in gitrev recipe
0cd0ef349420c737ac22c5214bec60df8b0fef21 by noreply:
rpm: Pass --nodebuginfo to rpmbuild when debuginfo is disabled by
126e4e4154f8dba903cc9ad470c5e7aab97e0b8f by noreply:
CI: mask amx-tile in the QEMU build VMs
3f24de7cafe2d239fd19ef0064566f8182b2e384 by behlendorf1:
Fix permanent errors misfiled into the scrub error log
5613733c1202114815555acce2de3c32d868ef90 by behlendorf1:
zpool: explain an error log that resolves to no files
5db13c7470a4bbed57bfc906ffdd13c59096b8b9 by noreply:
build: Add -dirty release tag when building packages from a dirty git
ccce7872940696056434ed1163530bd3c62864cc by noreply:
ZIO: Order a batch arrival against the hold it releases
bff8b63975accf9f89015f7fe1318df782b6f61a by behlendorf1:
linux: remove platform gates from platform headers
0b28198728f791e7e4ac989f33ff37da9b1319bc by behlendorf1:
libspl: remove platform gates from platform headers
1bee2ef8246c0ee2077db75fb8f2b4000897646f by behlendorf1:
zfs: remove _KERNEL gates
3aa3b18b1f124124e85a616db087024bedecb4ad by behlendorf1:
nvpair: remove _KERNEL gates
0cefc881964e744a4d99406227121d154e843613 by behlendorf1:
lua: remove _KERNEL gates
5c92413633444e8ca7de17ad031cb9c761570d07 by behlendorf1:
icp: remove _KERNEL gates
721dd978754e8993df888ae9f052ed0dc5fe5d57 by behlendorf1:
linux: remove _KERNEL gates
21cbe5a82784e4b9b4e11874ac1757e655bc96cc by behlendorf1:
freebsd: remove _KERNEL gates
c792317f21d9fe895a44fc7eff86c242795c9c57 by noreply:
Avoid dp_lock in the dirty space accounting
7fd87803e28a673b5300af9d4db3d0f4d7ef69cf by noreply:
Make the spa_config_lock reader fast path lockless
0eff7a30b82ee15283e3aeb2b527b2fdf0dd91aa by noreply:
rpm: Add configure caching if used in main configure run
c21c4ff4bed018ce2d5bd585ee8c5b3c161a0593 by noreply:
zed: fix failure domain detection for unavail case
47bb43aab8710dda63640f2871ce0cea3a22cd8a by noreply:
zstream: command line and man page cleanup
695b02eda407a47c92b0a9c3500c4a17e435f642 by noreply:
ZTS: Speed up replace_resilver_sit_out
a83d968356f5154f854292b1b51ae086a7a13d73 by noreply:
libzfs: do not iterate snapshots for a mountpoint changelist
9d7260c9b4a173db966c06d748ce286858501189 by noreply:
Propagate vdev state change on probe failure
946be3a33df4addb0d90c7cb581e26cb52c99e02 by noreply:
FreeBSD: remove legacy ioctl support
ef16a7b64458878f274940ae3ac1d6a6574d086b by noreply:
rpm: Make dash compatible
c146d1391a71467b8d82994d6dc81efcb718cf6a by noreply:
deb: Allow building when builddir is not srcdir
1f7a484cf514baff8d01ba14d6487cf0ed4fba2b by noreply:
deb: Print error message when build depends are not satified
0d5bb1d010ae0cf85abcd88d7e8d9a330df615fd by noreply:
pkg: Fix rpm warnings about not being able to read its database
cb563b4a90676ab4855a4515edc3bb70e383c813 by noreply:
build: Use release version from META for git builds
060f30c91866aa4c5b51c1dfa62748d4838c9dcb by noreply:
CI: Remove centos-streamX from default builders
a58b0d52a416e9364885ba987fffc666ab5b872d by noreply:
pkg: Check for Berkeley DB RPM database format
1d9c32c1602bde24791d1b1dc09c4c03cb6b9358 by noreply:
zpool: accept more redundant special and dedup vdevs
565e4c6891fd2bdcb05080bf91025b4ac70fa4c2 by behlendorf1:
Linux: report a snapshot's fsid from its .zfs/snapshot entry
db57b84c9cc823912da484f61ffcde059789928b by behlendorf1:
Linux: read the snapshot creation time from its bonus buffer
638abd22a9450b82d602f1082ad11113a945f7ab by noreply:
zfs_domount: fix vfs_t double-free on root setup failure
a5b1f324aa8a28aa7564aa4d8bea3fe87f75ef7b by noreply:
zpool-prefetch: Fix document description typo
1f380a4f34da6068d22960807f53cda68a356add by noreply:
deb: Use release number generated by ZFS for native builds
e1c59c909d63931dae999479ecd01e3cf1855543 by kbowling:
cxgbe: Report SR-IOV VF status
The failed test cases:
54 tests failed.
FAILED: lib.libbe.be_create.libbe_create
Error Message:
atf-check failed; see the output of the test for details
FAILED: sbin.bectl.bectl_test.bectl_create
Error Message:
atf-check failed; see the output of the test for details
FAILED: sbin.bectl.bectl_test.bectl_destroy
Error Message:
atf-check failed; see the output of the test for details
FAILED: sbin.bectl.bectl_test.bectl_destroy_bootonce
Error Message:
atf-check failed; see the output of the test for details
FAILED: sbin.bectl.bectl_test.bectl_export_import
Error Message:
atf-check failed; see the output of the test for details
FAILED: sbin.bectl.bectl_test.bectl_jail
Error Message:
atf-check failed; see the output of the test for details
FAILED: sbin.bectl.bectl_test.bectl_list
Error Message:
atf-check failed; see the output of the test for details
FAILED: sbin.bectl.bectl_test.bectl_mount
Error Message:
atf-check failed; see the output of the test for details
FAILED: sbin.bectl.bectl_test.bectl_promotion
Error Message:
atf-check failed; see the output of the test for details
FAILED: sbin.bectl.bectl_test.bectl_rename
Error Message:
atf-check failed; see the output of the test for details
FAILED: sbin.bectl.bectl_test.bectl_rename_bootonce
Error Message:
atf-check failed; see the output of the test for details
FAILED: sys.acl.01.main
Error Message:
Bailed out
FAILED: sys.acl.03.main
Error Message:
Bailed out
FAILED: sys.acl.04.main
Error Message:
Bailed out
FAILED: sys.aio.aio_test.vectored_unaligned
Error Message:
/usr/src/tests/sys/aio/aio_test.c:1001: 0 != system(cmd): zpool create failed: No error: 0
FAILED: sys.aio.aio_test.vectored_zvol_poll
Error Message:
/usr/src/tests/sys/aio/aio_test.c:1001: 0 != system(cmd): zpool create failed: No error: 0
FAILED: sys.fs.pjdfstest.zfs.zfs
Error Message:
atf-check failed; see the output of the test for details
FAILED: sys.fs.pjdfstest.zfs.zfs_nullfs
Error Message:
atf-check failed; see the output of the test for details
FAILED: sys.netpfil.pf.pfsync.bulk
Error Message:
state not found on synced host
FAILED: sys.netpfil.pf.syncookie.basic_v6
Error Message:
Failed to connect to syncookie protected echo daemon
FAILED: usr.sbin.makefs.makefs_zfs_tests.T_flag_F_flag
Error Message:
atf-check failed; see the output of the test for details
FAILED: usr.sbin.makefs.makefs_zfs_tests.T_flag_dir
Error Message:
atf-check failed; see the output of the test for details
FAILED: usr.sbin.makefs.makefs_zfs_tests.T_flag_mtree
Error Message:
atf-check failed; see the output of the test for details
FAILED: usr.sbin.makefs.makefs_zfs_tests.autoexpand
Error Message:
atf-check failed; see the output of the test for details
FAILED: usr.sbin.makefs.makefs_zfs_tests.basic
Error Message:
atf-check failed; see the output of the test for details
FAILED: usr.sbin.makefs.makefs_zfs_tests.compression
Error Message:
atf-check failed; see the output of the test for details
FAILED: usr.sbin.makefs.makefs_zfs_tests.dataset_removal
Error Message:
atf-check failed; see the output of the test for details
FAILED: usr.sbin.makefs.makefs_zfs_tests.devfs
Error Message:
atf-check failed; see the output of the test for details
FAILED: usr.sbin.makefs.makefs_zfs_tests.empty_dir
Error Message:
atf-check failed; see the output of the test for details
FAILED: usr.sbin.makefs.makefs_zfs_tests.empty_fs
Error Message:
atf-check failed; see the output of the test for details
FAILED: usr.sbin.makefs.makefs_zfs_tests.file_extend
Error Message:
atf-check failed; see the output of the test for details
FAILED: usr.sbin.makefs.makefs_zfs_tests.file_sizes
Error Message:
atf-check failed; see the output of the test for details
FAILED: usr.sbin.makefs.makefs_zfs_tests.hard_links
Error Message:
atf-check failed; see the output of the test for details
FAILED: usr.sbin.makefs.makefs_zfs_tests.indirect_dnode_array
Error Message:
atf-check failed; see the output of the test for details
FAILED: usr.sbin.makefs.makefs_zfs_tests.long_file_name
Error Message:
atf-check failed; see the output of the test for details
FAILED: usr.sbin.makefs.makefs_zfs_tests.multi_dataset_1
Error Message:
atf-check failed; see the output of the test for details
FAILED: usr.sbin.makefs.makefs_zfs_tests.multi_dataset_2
Error Message:
atf-check failed; see the output of the test for details
FAILED: usr.sbin.makefs.makefs_zfs_tests.multi_dataset_3
Error Message:
atf-check failed; see the output of the test for details
FAILED: usr.sbin.makefs.makefs_zfs_tests.multi_dataset_4
Error Message:
atf-check failed; see the output of the test for details
FAILED: usr.sbin.makefs.makefs_zfs_tests.multi_dataset_5
Error Message:
atf-check failed; see the output of the test for details
FAILED: usr.sbin.makefs.makefs_zfs_tests.multi_staging_1
Error Message:
atf-check failed; see the output of the test for details
FAILED: usr.sbin.makefs.makefs_zfs_tests.multi_staging_2
Error Message:
atf-check failed; see the output of the test for details
FAILED: usr.sbin.makefs.makefs_zfs_tests.path_vdev_props
Error Message:
atf-check failed; see the output of the test for details
FAILED: usr.sbin.makefs.makefs_zfs_tests.perms
Error Message:
atf-check failed; see the output of the test for details
FAILED: usr.sbin.makefs.makefs_zfs_tests.root_props
Error Message:
atf-check failed; see the output of the test for details
FAILED: usr.sbin.makefs.makefs_zfs_tests.snapshot
Error Message:
atf-check failed; see the output of the test for details
FAILED: usr.sbin.makefs.makefs_zfs_tests.soft_links
Error Message:
atf-check failed; see the output of the test for details
FAILED: usr.sbin.makefs.makefs_zfs_tests.used_space_props
Error Message:
atf-check failed; see the output of the test for details
FAILED: sys.kern.ssl_sendfile.eagain_vs_eof
Error Message:
/usr/src/tests/sys/kern/ssl_sendfile.c:485: c.sbytes == -1 not met
FAILED: lib.libexecinfo.sigtramp_test.test_backtrace_sigtramp
Error Message:
/usr/src/lib/libexecinfo/tests/sigtramp_test.c:30: n > 1 not met
FAILED: sys.kern.ssl_sendfile.grow
Error Message:
Test case body timed out
FAILED: sys.net.if_lagg_test.witness
Error Message:
Lock-order reversals involving if_lagg.c detected
FAILED: sys.netinet.udp_bindings.connect_bound_socket_from_2address_jail
Error Message:
/usr/src/tests/sys/netinet/udp_bindings.c:244: connect(s, (struct sockaddr *)&sin, sizeof(sin)) == 0 not met
FAILED: sys.netlink.netlink_socket.overflow
Error Message:
/usr/src/tests/sys/netlink/netlink_socket.c:146: send(fd, &hdr, sizeof(hdr), 0) == sizeof(hdr) not met