FreeBSD-main-amd64-test - Build #29590 - Still Unstable

From: <jenkins-admin_at_FreeBSD.org>
Date: Wed, 30 Sep 2026 02:50:19 UTC
FreeBSD-main-amd64-test - Build #29590 (806adba81f3d808994b0cec955c38ef1a089e739) - Still Unstable

Build information: https://ci.FreeBSD.org/job/FreeBSD-main-amd64-test/29590/
Full change log: https://ci.FreeBSD.org/job/FreeBSD-main-amd64-test/29590/changes
Full build log: https://ci.FreeBSD.org/job/FreeBSD-main-amd64-test/29590/console

Status explanation:
"Unstable" - some tests are suspected being broken by the following changes
"Still Unstable" - the failing test cases have not been fixed by these
                   following changes and this is a notification to note that
                   these changes have not been fully tested by the CI system

Change summaries:
(Those commits are likely but not certainly responsible)

b4fdb5c236d00825c8e3ea8ffc7bc25dafb6abcf by mm:
zfs: add btree.c to libzfs

6aef93facf8e0f7ca46c7aeb3d4fa6826fb7b779 by mm:
Revert "zfs: add btree.c to libzfs"

0dac2c53270193d99b1bd648966132b1f6d523ac by mm:
Revert "zpool: Add zpool status -vv error ranges"

806adba81f3d808994b0cec955c38ef1a089e739 by rcm:
libpfctl: decode PFR_A_AF into a u8



The failed test cases:

8 tests failed.
FAILED:  sys.kern.ssl_sendfile.truncate

Error Message:
Test case body timed out

FAILED:  sys.netpfil.pf.pfsync.bulk

Error Message:
state not found on synced host

FAILED:  sys.kern.ssl_sendfile.eagain_vs_eof

Error Message:
/usr/src/tests/sys/kern/ssl_sendfile.c:485: c.sbytes == -1 not met

FAILED:  lib.libexecinfo.sigtramp_test.test_backtrace_sigtramp

Error Message:
/usr/src/lib/libexecinfo/tests/sigtramp_test.c:30: n > 1 not met

FAILED:  sys.kern.ssl_sendfile.grow

Error Message:
Test case body timed out

FAILED:  sys.net.if_lagg_test.witness

Error Message:
Lock-order reversals involving if_lagg.c detected

FAILED:  sys.netinet.udp_bindings.connect_bound_socket_from_2address_jail

Error Message:
/usr/src/tests/sys/netinet/udp_bindings.c:244: connect(s, (struct sockaddr *)&sin, sizeof(sin)) == 0 not met

FAILED:  sys.netlink.netlink_socket.overflow

Error Message:
/usr/src/tests/sys/netlink/netlink_socket.c:146: send(fd, &hdr, sizeof(hdr), 0) == sizeof(hdr) not met