FreeBSD-main-amd64-test - Build #29551 - Still Unstable
Date: Thu, 24 Sep 2026 10:45:00 UTC
FreeBSD-main-amd64-test - Build #29551 (8d94a93d967bbb985813aa5561c823ab5f75bb73) - Still Unstable
Build information: https://ci.FreeBSD.org/job/FreeBSD-main-amd64-test/29551/
Full change log: https://ci.FreeBSD.org/job/FreeBSD-main-amd64-test/29551/changes
Full build log: https://ci.FreeBSD.org/job/FreeBSD-main-amd64-test/29551/console
Status explanation:
"Unstable" - some tests are suspected being broken by the following changes
"Still Unstable" - the failing test cases have not been fixed by these
following changes and this is a notification to note that
these changes have not been fully tested by the CI system
Change summaries:
(Those commits are likely but not certainly responsible)
ac9c07a3e90888d69d0a524de520d4de8ae60de5 by kib:
linuxkpi: Fix double-cleanup in linux_pci_attach_device() error path
2449fa9c4d8e60cca863396dc3c7d67cbc16359f by gallatin:
hwpmc: hwpmc: record page size to fix analysis in some case
72e391060bb6c83ed65ac7ca3936bd6e07ab1ebc by sobomax:
stat(2): Document st_bsdflags and SFBSD_NAMEDATTR
df7b90556859e1e5dbaf8d3dae2177ca607c0558 by jhb:
dtrace: Remove bogus Makefile.inc
600c16c71ba1c1e0ad176437bcfeea12492d5ae7 by jhb:
x86/NOTES: Drop stale comments about si(4)
e702b1af009d2303431e099afa00936b287ee552 by jhb:
sys: Remove orphaned build glue for le(4)
9cfc15bdfbc4459491c55518a41c447dfdadcc51 by jhb:
ObsoleteFiles.inc: Add another entry for perfmon.4.gz
c934939aa711ed839631fca98ce8789a46960183 by jhb:
apm.8: Don't claim that zzz(8) invokes apm(8)
ddaa6746a30b458ba234324622a66747d09a2b6c by ziaee:
sesutil.8: Concise document description, tag SPDX
0bd6348b52e1991fafc55128173c989dab36dfd9 by asomers:
fusefs: fix a deadlock caused by daemons that never initialize
10a3562a019b4eaaa0f5c50a15d739c43e41e8e7 by jamie:
jail: set default root directory for a jail to its parent's root.
8fd09407c8e64fd26d095c9b00990c545577db5a by ngie:
atf-sh/integration_test: fix hang when invoked via kyua
The failed test cases:
8 tests failed.
FAILED: sys.kern.ssl_sendfile.eagain_vs_eof
Error Message:
/usr/src/tests/sys/kern/ssl_sendfile.c:485: c.sbytes == -1 not met
FAILED: sys.netpfil.pf.pfsync.bulk
Error Message:
state not found on synced host
FAILED: lib.libexecinfo.sigtramp_test.test_backtrace_sigtramp
Error Message:
/usr/src/lib/libexecinfo/tests/sigtramp_test.c:30: n > 1 not met
FAILED: sys.kern.ssl_sendfile.truncate
Error Message:
Test case body timed out
FAILED: sys.kern.ssl_sendfile.grow
Error Message:
Test case body timed out
FAILED: sys.net.if_lagg_test.witness
Error Message:
Lock-order reversals involving if_lagg.c detected
FAILED: sys.netinet.udp_bindings.connect_bound_socket_from_2address_jail
Error Message:
/usr/src/tests/sys/netinet/udp_bindings.c:244: connect(s, (struct sockaddr *)&sin, sizeof(sin)) == 0 not met
FAILED: sys.netlink.netlink_socket.overflow
Error Message:
/usr/src/tests/sys/netlink/netlink_socket.c:146: send(fd, &hdr, sizeof(hdr), 0) == sizeof(hdr) not met