FreeBSD-main-amd64-test - Build #29550 - Still Unstable
Date: Thu, 24 Sep 2026 08:08:52 UTC
FreeBSD-main-amd64-test - Build #29550 (34f131f1de853ae824a6e67dd6429332d23b373d) - Still Unstable
Build information: https://ci.FreeBSD.org/job/FreeBSD-main-amd64-test/29550/
Full change log: https://ci.FreeBSD.org/job/FreeBSD-main-amd64-test/29550/changes
Full build log: https://ci.FreeBSD.org/job/FreeBSD-main-amd64-test/29550/console
Status explanation:
"Unstable" - some tests are suspected being broken by the following changes
"Still Unstable" - the failing test cases have not been fixed by these
following changes and this is a notification to note that
these changes have not been fully tested by the CI system
Change summaries:
(Those commits are likely but not certainly responsible)
ad57f212665e1642423afb83aef19e755833643f by seuros:
nvme: do not touch INTMS/INTMC when configured for MSI-X
34f131f1de853ae824a6e67dd6429332d23b373d by seuros:
nvme: bound the AER error log byte-swap by the fetched length
The failed test cases:
8 tests failed.
FAILED: sys.netlink.test_rtnl_route.rtnl_nhgrp_expire
Error Message:
1 checks failed; see output for more details
FAILED: libexec.atf.atf-sh.integration_test.require_progs
Error Message:
Test case body timed out
FAILED: lib.libexecinfo.sigtramp_test.test_backtrace_sigtramp
Error Message:
/usr/src/lib/libexecinfo/tests/sigtramp_test.c:30: n > 1 not met
FAILED: sys.kern.ssl_sendfile.truncate
Error Message:
Test case body timed out
FAILED: sys.kern.ssl_sendfile.grow
Error Message:
Test case body timed out
FAILED: sys.net.if_lagg_test.witness
Error Message:
Lock-order reversals involving if_lagg.c detected
FAILED: sys.netinet.udp_bindings.connect_bound_socket_from_2address_jail
Error Message:
/usr/src/tests/sys/netinet/udp_bindings.c:244: connect(s, (struct sockaddr *)&sin, sizeof(sin)) == 0 not met
FAILED: sys.netlink.netlink_socket.overflow
Error Message:
/usr/src/tests/sys/netlink/netlink_socket.c:146: send(fd, &hdr, sizeof(hdr), 0) == sizeof(hdr) not met