FreeBSD-main-amd64-test - Build #29549 - Still Unstable

From: <jenkins-admin_at_FreeBSD.org>
Date: Thu, 24 Sep 2026 05:27:32 UTC
FreeBSD-main-amd64-test - Build #29549 (ba974faaf30b74472acc4f0dc5853a22d43951f2) - Still Unstable

Build information: https://ci.FreeBSD.org/job/FreeBSD-main-amd64-test/29549/
Full change log: https://ci.FreeBSD.org/job/FreeBSD-main-amd64-test/29549/changes
Full build log: https://ci.FreeBSD.org/job/FreeBSD-main-amd64-test/29549/console

Status explanation:
"Unstable" - some tests are suspected being broken by the following changes
"Still Unstable" - the failing test cases have not been fixed by these
                   following changes and this is a notification to note that
                   these changes have not been fully tested by the CI system

Change summaries:
(Those commits are likely but not certainly responsible)

7c5e457d3afdc7742ee24f0b5ee6e5e7aa00a6bd by markj:
ktls: Fix an off-by-one bug in tls13_find_record_type()

ba974faaf30b74472acc4f0dc5853a22d43951f2 by markj:
posixshm: Fix a double unlock in shm_partial_page_invalidate()



The failed test cases:

9 tests failed.
FAILED:  sys.netpfil.pf.pfsync.bulk

Error Message:
state not found on synced host

FAILED:  sys.kern.ssl_sendfile.eagain_vs_eof

Error Message:
/usr/src/tests/sys/kern/ssl_sendfile.c:485: c.sbytes == -1 not met

FAILED:  libexec.atf.atf-sh.integration_test.require_progs

Error Message:
Test case body timed out

FAILED:  lib.libexecinfo.sigtramp_test.test_backtrace_sigtramp

Error Message:
/usr/src/lib/libexecinfo/tests/sigtramp_test.c:30: n > 1 not met

FAILED:  sys.kern.ssl_sendfile.truncate

Error Message:
Test case body timed out

FAILED:  sys.kern.ssl_sendfile.grow

Error Message:
Test case body timed out

FAILED:  sys.net.if_lagg_test.witness

Error Message:
Lock-order reversals involving if_lagg.c detected

FAILED:  sys.netinet.udp_bindings.connect_bound_socket_from_2address_jail

Error Message:
/usr/src/tests/sys/netinet/udp_bindings.c:244: connect(s, (struct sockaddr *)&sin, sizeof(sin)) == 0 not met

FAILED:  sys.netlink.netlink_socket.overflow

Error Message:
/usr/src/tests/sys/netlink/netlink_socket.c:146: send(fd, &hdr, sizeof(hdr), 0) == sizeof(hdr) not met