FreeBSD-main-amd64-test - Build #29552 - Still Unstable

From: <jenkins-admin_at_FreeBSD.org>
Date: Thu, 24 Sep 2026 13:21:26 UTC
FreeBSD-main-amd64-test - Build #29552 (85fb40bad584e7d8c503e5a99bb81cc2d3cf9fee) - Still Unstable

Build information: https://ci.FreeBSD.org/job/FreeBSD-main-amd64-test/29552/
Full change log: https://ci.FreeBSD.org/job/FreeBSD-main-amd64-test/29552/changes
Full build log: https://ci.FreeBSD.org/job/FreeBSD-main-amd64-test/29552/console

Status explanation:
"Unstable" - some tests are suspected being broken by the following changes
"Still Unstable" - the failing test cases have not been fixed by these
                   following changes and this is a notification to note that
                   these changes have not been fully tested by the CI system

Change summaries:
(Those commits are likely but not certainly responsible)

e960cb4c033c8f65af1e8b09310c1bd5414f21ac by imp:
edk2: Import Loadfile2.h and TcgService.h from edk2-stable202502

85fb40bad584e7d8c503e5a99bb81cc2d3cf9fee by imp:
loader.efi: Use EfiLoaderData memory type for ram disks



The failed test cases:

8 tests failed.
FAILED:  sys.kern.ssl_sendfile.eagain_vs_eof

Error Message:
/usr/src/tests/sys/kern/ssl_sendfile.c:485: c.sbytes == -1 not met

FAILED:  sys.netpfil.pf.pfsync.bulk

Error Message:
state not found on synced host

FAILED:  lib.libexecinfo.sigtramp_test.test_backtrace_sigtramp

Error Message:
/usr/src/lib/libexecinfo/tests/sigtramp_test.c:30: n > 1 not met

FAILED:  sys.kern.ssl_sendfile.truncate

Error Message:
Test case body timed out

FAILED:  sys.kern.ssl_sendfile.grow

Error Message:
Test case body timed out

FAILED:  sys.net.if_lagg_test.witness

Error Message:
Lock-order reversals involving if_lagg.c detected

FAILED:  sys.netinet.udp_bindings.connect_bound_socket_from_2address_jail

Error Message:
/usr/src/tests/sys/netinet/udp_bindings.c:244: connect(s, (struct sockaddr *)&sin, sizeof(sin)) == 0 not met

FAILED:  sys.netlink.netlink_socket.overflow

Error Message:
/usr/src/tests/sys/netlink/netlink_socket.c:146: send(fd, &hdr, sizeof(hdr), 0) == sizeof(hdr) not met