FreeBSD-main-amd64-test - Build #29523 - Still Unstable

From: <jenkins-admin_at_FreeBSD.org>
Date: Fri, 18 Sep 2026 15:03:39 UTC
FreeBSD-main-amd64-test - Build #29523 (ef821f9ba66af44cd7a760451ecd706cd24b1ecb) - Still Unstable

Build information: https://ci.FreeBSD.org/job/FreeBSD-main-amd64-test/29523/
Full change log: https://ci.FreeBSD.org/job/FreeBSD-main-amd64-test/29523/changes
Full build log: https://ci.FreeBSD.org/job/FreeBSD-main-amd64-test/29523/console

Status explanation:
"Unstable" - some tests are suspected being broken by the following changes
"Still Unstable" - the failing test cases have not been fixed by these
                   following changes and this is a notification to note that
                   these changes have not been fully tested by the CI system

Change summaries:
(Those commits are likely but not certainly responsible)

7f5f07b139a5fd456087804ee96802b54c151703 by bnovkov:
db/hash: Harden hash(3) database code

ef821f9ba66af44cd7a760451ecd706cd24b1ecb by bnovkov:
bhyve: Add an option to prevent automatic restart in monitor mode



The failed test cases:

4 tests failed.
FAILED:  sys.netpfil.pf.pfsync.bulk

Error Message:
state not found on synced host

FAILED:  sys.net.if_lagg_test.witness

Error Message:
Lock-order reversals involving if_lagg.c detected

FAILED:  sys.netinet.udp_bindings.connect_bound_socket_from_2address_jail

Error Message:
/usr/src/tests/sys/netinet/udp_bindings.c:244: connect(s, (struct sockaddr *)&sin, sizeof(sin)) == 0 not met

FAILED:  sys.netlink.netlink_socket.overflow

Error Message:
/usr/src/tests/sys/netlink/netlink_socket.c:146: send(fd, &hdr, sizeof(hdr), 0) == sizeof(hdr) not met