FreeBSD-main-amd64-test - Build #29522 - Still Unstable
Date: Fri, 18 Sep 2026 12:37:14 UTC
FreeBSD-main-amd64-test - Build #29522 (d749076e80a2f2627fea5dfd3d328cc4fb767ec9) - Still Unstable
Build information: https://ci.FreeBSD.org/job/FreeBSD-main-amd64-test/29522/
Full change log: https://ci.FreeBSD.org/job/FreeBSD-main-amd64-test/29522/changes
Full build log: https://ci.FreeBSD.org/job/FreeBSD-main-amd64-test/29522/console
Status explanation:
"Unstable" - some tests are suspected being broken by the following changes
"Still Unstable" - the failing test cases have not been fixed by these
following changes and this is a notification to note that
these changes have not been fully tested by the CI system
Change summaries:
(Those commits are likely but not certainly responsible)
d749076e80a2f2627fea5dfd3d328cc4fb767ec9 by wulf:
linux_page.c: Fix whitespace
The failed test cases:
3 tests failed.
FAILED: sys.net.if_lagg_test.witness
Error Message:
Lock-order reversals involving if_lagg.c detected
FAILED: sys.netinet.udp_bindings.connect_bound_socket_from_2address_jail
Error Message:
/usr/src/tests/sys/netinet/udp_bindings.c:244: connect(s, (struct sockaddr *)&sin, sizeof(sin)) == 0 not met
FAILED: sys.netlink.netlink_socket.overflow
Error Message:
/usr/src/tests/sys/netlink/netlink_socket.c:146: send(fd, &hdr, sizeof(hdr), 0) == sizeof(hdr) not met