FreeBSD-main-amd64-test - Build #29521 - Still Unstable
Date: Fri, 18 Sep 2026 10:10:10 UTC
FreeBSD-main-amd64-test - Build #29521 (54b5d177aa988207a4ca68763ac8e20c8145c17f) - Still Unstable
Build information: https://ci.FreeBSD.org/job/FreeBSD-main-amd64-test/29521/
Full change log: https://ci.FreeBSD.org/job/FreeBSD-main-amd64-test/29521/changes
Full build log: https://ci.FreeBSD.org/job/FreeBSD-main-amd64-test/29521/console
Status explanation:
"Unstable" - some tests are suspected being broken by the following changes
"Still Unstable" - the failing test cases have not been fixed by these
following changes and this is a notification to note that
these changes have not been fully tested by the CI system
Change summaries:
(Those commits are likely but not certainly responsible)
54b5d177aa988207a4ca68763ac8e20c8145c17f by wulf:
LinuxKPI: Add devm_memremap and devm_ioremap_wc functions
The failed test cases:
5 tests failed.
FAILED: sys.netinet6.ndp.ndp_prefix_lifetime
Error Message:
atf-check failed; see the output of the test for details
FAILED: sys.netpfil.common.dummynet.pf_pls_gilbert
Error Message:
atf-check failed; see the output of the test for details
FAILED: sys.net.if_lagg_test.witness
Error Message:
Lock-order reversals involving if_lagg.c detected
FAILED: sys.netinet.udp_bindings.connect_bound_socket_from_2address_jail
Error Message:
/usr/src/tests/sys/netinet/udp_bindings.c:244: connect(s, (struct sockaddr *)&sin, sizeof(sin)) == 0 not met
FAILED: sys.netlink.netlink_socket.overflow
Error Message:
/usr/src/tests/sys/netlink/netlink_socket.c:146: send(fd, &hdr, sizeof(hdr), 0) == sizeof(hdr) not met