FreeBSD-main-amd64-test - Build #29520 - Still Unstable
Date: Fri, 18 Sep 2026 06:28:08 UTC
FreeBSD-main-amd64-test - Build #29520 (31a77c113507d5e7689996976679a972a11ff5f7) - Still Unstable
Build information: https://ci.FreeBSD.org/job/FreeBSD-main-amd64-test/29520/
Full change log: https://ci.FreeBSD.org/job/FreeBSD-main-amd64-test/29520/changes
Full build log: https://ci.FreeBSD.org/job/FreeBSD-main-amd64-test/29520/console
Status explanation:
"Unstable" - some tests are suspected being broken by the following changes
"Still Unstable" - the failing test cases have not been fixed by these
following changes and this is a notification to note that
these changes have not been fully tested by the CI system
Change summaries:
(Those commits are likely but not certainly responsible)
13d5f20e5b9ecb42ecf7de4e98d5af0bd5d63c82 by bapt:
nuageinit: fix support on OpenStack
2c59dd4cfdd6b95f0aa05a6bd886be672a39f105 by obiwac:
acpi: Set status to AE_ERROR if device suspend failed
3eaa8b19ba1fdbe41a46dc84c4278e9eb5d49608 by otis:
man: Link enic.4 to if_enic.4
d44390fa3c72699436449fd15ce9b71f1473c03f by kbowling:
ice: Validate VF virtchnl configuration
e70ff92d243104834ad40581c3562a55d7525cc8 by kbowling:
ice: Add malformed virtchnl injection points
3bdc281f5df0003d745b4e911f5d583bf5938317 by kbowling:
ice: Enforce VF MAC anti-spoof policy
66d271178feb4a07c774204352228db517c596dc by kbowling:
ice: Fail closed when VF reset does not complete
66e06f842b9aaf2891173d916afb1aeef93977a6 by ziaee:
ossl.4: Canonicalize SYNOPSIS + tag SPDX
8a8c14464dd372495c9bf4b87c9b88d73f78d587 by dim:
Merge commit 1f332ae4f1b3 from llvm-project (by Alexander Kornienko):
d577b4ed588c0f259d7298188233b17dc0435dd4 by dim:
bsd.sys.mk: make clang 23 -Wunused-but-set-global non-fatal
bcd0d76d4882dd8d19a49c050411b5c58a0deb74 by dim:
kern.mk: make clang 23 -Wunused-but-set-global non-fatal
9d467dfa31922b3b2fbb145f202200bf66ca550a by bz:
mthca: apply upstream changes to convert to timer_setup() LinuxKPI
272138c279dd1954f3fb88d9e0b2874db74597a3 by bz:
mlx4: apply upstream changes to convert to timer_setup() Linux KPI
871c09c9b47eb0ef0f17a5a1fc2299dba7693516 by bz:
mlx4: convert to timer_setup() Linux KPI
3769ee9bc4167d4f508ba4f14cf544dedf7c520e by bz:
mlx5: remove init_timer()
9d18e2c12629eba4229564a17c1fa3adf15bb5ac by bz:
LinuxKPI: remove timer KPI from Linux version before 4.15
bcf6be6deea7b390fc332d3adb0437b4e540d073 by kbowling:
ice: Quiesce VFs before device reset
31fb4efd211cbb2ea79463c6e8522bb362e29129 by kbowling:
ice: Add VF reset and policy failure injection
3faea48e117939ae41f92c8738784d8e38a78612 by kbowling:
ice: Make VF MAC filter requests idempotent
43851fba2d9a336792dcabcac2fe1789837c71d7 by kbowling:
ice(4): Correct SR-IOV filter defaults
923b9a80c21ff178ceb4ffb23374e9ef924adb66 by kbowling:
ice: Isolate VFs after malicious-driver detection
cef57e81ce906bcceb0bd3097021be4110f192c5 by kbowling:
ice: Protect the PF mailbox from flooding VFs
31a77c113507d5e7689996976679a972a11ff5f7 by kbowling:
ice: Report SR-IOV VF status
The failed test cases:
5 tests failed.
FAILED: sys.netpfil.pf.syncookie.basic_v6
Error Message:
Failed to connect to syncookie protected echo daemon
FAILED: sys.netpfil.pf.pfsync.bulk
Error Message:
state not found on synced host
FAILED: sys.net.if_lagg_test.witness
Error Message:
Lock-order reversals involving if_lagg.c detected
FAILED: sys.netinet.udp_bindings.connect_bound_socket_from_2address_jail
Error Message:
/usr/src/tests/sys/netinet/udp_bindings.c:244: connect(s, (struct sockaddr *)&sin, sizeof(sin)) == 0 not met
FAILED: sys.netlink.netlink_socket.overflow
Error Message:
/usr/src/tests/sys/netlink/netlink_socket.c:146: send(fd, &hdr, sizeof(hdr), 0) == sizeof(hdr) not met