FreeBSD-main-amd64-test - Build #29519 - Still Unstable

From: <jenkins-admin_at_FreeBSD.org>
Date: Fri, 18 Sep 2026 02:12:20 UTC
FreeBSD-main-amd64-test - Build #29519 (ee18cb07106f86ceb8e0b77c2efd19417468f66e) - Still Unstable

Build information: https://ci.FreeBSD.org/job/FreeBSD-main-amd64-test/29519/
Full change log: https://ci.FreeBSD.org/job/FreeBSD-main-amd64-test/29519/changes
Full build log: https://ci.FreeBSD.org/job/FreeBSD-main-amd64-test/29519/console

Status explanation:
"Unstable" - some tests are suspected being broken by the following changes
"Still Unstable" - the failing test cases have not been fixed by these
                   following changes and this is a notification to note that
                   these changes have not been fully tested by the CI system

Change summaries:
(Those commits are likely but not certainly responsible)

ee18cb07106f86ceb8e0b77c2efd19417468f66e by ziaee:
enic.4: Canonicalize SYNOPSIS, describe better



The failed test cases:

4 tests failed.
FAILED:  sys.netpfil.pf.pfsync.bulk

Error Message:
state not found on synced host

FAILED:  sys.net.if_lagg_test.witness

Error Message:
Lock-order reversals involving if_lagg.c detected

FAILED:  sys.netinet.udp_bindings.connect_bound_socket_from_2address_jail

Error Message:
/usr/src/tests/sys/netinet/udp_bindings.c:244: connect(s, (struct sockaddr *)&sin, sizeof(sin)) == 0 not met

FAILED:  sys.netlink.netlink_socket.overflow

Error Message:
/usr/src/tests/sys/netlink/netlink_socket.c:146: send(fd, &hdr, sizeof(hdr), 0) == sizeof(hdr) not met