FreeBSD-main-amd64-test - Build #29524 - Still Unstable

From: <jenkins-admin_at_FreeBSD.org>
Date: Fri, 18 Sep 2026 17:30:12 UTC
FreeBSD-main-amd64-test - Build #29524 (758578370f6b726299c19f0e87355b91af1b90e5) - Still Unstable

Build information: https://ci.FreeBSD.org/job/FreeBSD-main-amd64-test/29524/
Full change log: https://ci.FreeBSD.org/job/FreeBSD-main-amd64-test/29524/changes
Full build log: https://ci.FreeBSD.org/job/FreeBSD-main-amd64-test/29524/console

Status explanation:
"Unstable" - some tests are suspected being broken by the following changes
"Still Unstable" - the failing test cases have not been fixed by these
                   following changes and this is a notification to note that
                   these changes have not been fully tested by the CI system

Change summaries:
(Those commits are likely but not certainly responsible)

63343822430453f4add20bcbfa134c99132361df by pouria:
route/fib_algo: Fix nexthop index collision across families

c9bfc37b61d299f6de4b6b9799db95181b3bd1d0 by obiwac:
acpi: Don't check suspend-to-idle if suspend failed

4afc2d5ac333f884049b0c1b06458d8387643131 by obiwac:
power: Move power-related eventhandler decls to sys/power.h

708dde6988b0dc5458e933066ca37f08e810ab19 by obiwac:
power: Add power_resume_check eventhandler

7ff26d59e7386bb92e4384ae8d1f9d2280acf511 by obiwac:
acpi: Invoke power_resume_check eventhandler

a23fa3fe1c0aa4e529b26bbec17d17571f8708fd by obiwac:
amdsmu: Diagnose S0i3 entry after resume

758578370f6b726299c19f0e87355b91af1b90e5 by obiwac:
amdsmu: Hints on what to do if IP block blocking S0i3



The failed test cases:

6 tests failed.
FAILED:  sys.net.if_wg.wg_basic_crossaf

Error Message:
atf-check failed; see the output of the test for details

FAILED:  sys.netinet6.frag6.frag6_07.frag6_07

Error Message:
atf-check failed; see the output of the test for details

FAILED:  sys.netpfil.pf.pfsync.bulk

Error Message:
state not found on synced host

FAILED:  sys.net.if_lagg_test.witness

Error Message:
Lock-order reversals involving if_lagg.c detected

FAILED:  sys.netinet.udp_bindings.connect_bound_socket_from_2address_jail

Error Message:
/usr/src/tests/sys/netinet/udp_bindings.c:244: connect(s, (struct sockaddr *)&sin, sizeof(sin)) == 0 not met

FAILED:  sys.netlink.netlink_socket.overflow

Error Message:
/usr/src/tests/sys/netlink/netlink_socket.c:146: send(fd, &hdr, sizeof(hdr), 0) == sizeof(hdr) not met