FreeBSD-main-amd64-test - Build #29709 - Still Unstable

From: <jenkins-admin_at_FreeBSD.org>
Date: Fri, 16 Oct 2026 06:53:03 UTC
FreeBSD-main-amd64-test - Build #29709 (3ca4b8dd162afbecb8de70dc44f525d708726b07) - Still Unstable

Build information: https://ci.FreeBSD.org/job/FreeBSD-main-amd64-test/29709/
Full change log: https://ci.FreeBSD.org/job/FreeBSD-main-amd64-test/29709/changes
Full build log: https://ci.FreeBSD.org/job/FreeBSD-main-amd64-test/29709/console

Status explanation:
"Unstable" - some tests are suspected being broken by the following changes
"Still Unstable" - the failing test cases have not been fixed by these
                   following changes and this is a notification to note that
                   these changes have not been fully tested by the CI system

Change summaries:
(Those commits are likely but not certainly responsible)

9664345efb8bb598536fd069c0dd797fc60ce1d2 by rcm:
libpfctl: Return max_win and mss of state peers

74d2a0b79ffd8d43da61eaca36b39935594d8772 by rcm:
pf: Parse the GETSTATES state id as 64 bits

9890a0d5e04a1b4cd398a52be6374734b9496cd3 by gallatin:
mbuf: move leaf_rcv union farther back in the pkthdr

83f5b5c2eeba2a2d66d87d4367ca5406322386a4 by gallatin:
__FreeBSD_version: Bump for changing pkthdr layout

167d3567c4b93650c8bcca86ff294226e6e1a9ce by andrew:
arm64/vmm: Treat Rt=31 as xzr in reg & instr emul

ac64294143ffea63c7dedf9a1859f88342bd998a by andrew:
arm64: Relax memory barriers around DMA operations

989d72fd3d35daa6a056afdd0c6b0aba4c5d8ccf by rcm:
pf: Free a table entry that cannot be routed

3ca4b8dd162afbecb8de70dc44f525d708726b07 by des:
auditdistd: Use fixed-length protocol names



The failed test cases:

8 tests failed.
FAILED:  sys.netpfil.pf.pfsync.bulk

Error Message:
state not found on synced host

FAILED:  sys.kern.ssl_sendfile.truncate

Error Message:
Test case body timed out

FAILED:  sys.kern.ssl_sendfile.eagain_vs_eof

Error Message:
/usr/src/tests/sys/kern/ssl_sendfile.c:485: c.sbytes == -1 not met

FAILED:  sys.kern.ssl_sendfile.grow

Error Message:
Test case body timed out

FAILED:  lib.libexecinfo.sigtramp_test.test_backtrace_sigtramp

Error Message:
/usr/src/lib/libexecinfo/tests/sigtramp_test.c:30: n > 1 not met

FAILED:  sys.net.if_lagg_test.witness

Error Message:
Lock-order reversals involving if_lagg.c detected

FAILED:  sys.netinet.udp_bindings.connect_bound_socket_from_2address_jail

Error Message:
/usr/src/tests/sys/netinet/udp_bindings.c:244: connect(s, (struct sockaddr *)&sin, sizeof(sin)) == 0 not met

FAILED:  sys.netlink.netlink_socket.overflow

Error Message:
/usr/src/tests/sys/netlink/netlink_socket.c:146: send(fd, &hdr, sizeof(hdr), 0) == sizeof(hdr) not met