FreeBSD-main-amd64-test - Build #29708 - Still Unstable

From: <jenkins-admin_at_FreeBSD.org>
Date: Fri, 16 Oct 2026 04:14:31 UTC
FreeBSD-main-amd64-test - Build #29708 (b43c4d84c8d172858fc4bbf59e07888bfb8ac472) - Still Unstable

Build information: https://ci.FreeBSD.org/job/FreeBSD-main-amd64-test/29708/
Full change log: https://ci.FreeBSD.org/job/FreeBSD-main-amd64-test/29708/changes
Full build log: https://ci.FreeBSD.org/job/FreeBSD-main-amd64-test/29708/console

Status explanation:
"Unstable" - some tests are suspected being broken by the following changes
"Still Unstable" - the failing test cases have not been fixed by these
                   following changes and this is a notification to note that
                   these changes have not been fully tested by the CI system

Change summaries:
(Those commits are likely but not certainly responsible)

8ff663dde22fe9f50ba5d71d0237bec9b9b44683 by sobomax:
ufs: make fdatasync(2) and O_DSYNC writes update the inode

1498efc4243e963503179547221335940e2aeded by sobomax:
ufs: make fdatasync(2) write dirty indirect blocks

26d84bb8bf9b4acd0aa80b0208c1ba4fc9646ff3 by sobomax:
ufs: flush soft updates dependencies for O_SYNC and O_DSYNC writes

e8534ba3ad36b88e94de0a3174e9ab7ac04a929d by sobomax:
ufs: do not let a rolled back inode write end a data-only sync

afe1dec7425c9f3bec1aafcfed15229a385894eb by sobomax:
tests: add UFS synchronous write durability tests

f3f5af331c741c34b3b0a2ac8c64f2a458f84e6d by delphij:
Fix buffer overflow bug in non-blocking gzwrite.

b5e6d60e57bad805a064b0795434bcf6c454fdd0 by pho:
stress2: Add a new FS type: UFS2 to the test.

f4ff995e361fa72cea240c4dbac2d0931965c80f by gallatin:
pfil: Avoid potential mbuf tag leak

2272fac218a88a6f25e696ec54ece2eedec39a38 by mhorne:
hwpmc: Add support for AMD-only IRPERF in hwpmc PERF class

ee8cb6ab6741014218a9157d316e1a675390edc4 by rcm:
tests/netinet6: Turn off stable addresses in ndp_prefix_len_mismatch

b5219c068fbc133dde91d5cf48423e34ce27bd4f by kp:
pf: first-match-wins for nat rules, even in anchors

b951994eddd4d274514df751da06680a32139037 by rcm:
pf: Set the reassembly flags under the rules lock

af08f29e5fc05d1e67370b36800b20ac95937a51 by kib:
tests/sys/fs/ufs/sync_test.c: hide the alignment warning

228d2ac511de3dda45c85a3af465c05b14c9162b by asomers:
Reformat the shutdown messages when debug.bootverbose is set

deadb35becaae2788888e12868428b3a0ebef34f by brooks:
updateuio_t: improve comment and style

b43c4d84c8d172858fc4bbf59e07888bfb8ac472 by ssaxena:
if_bnxt: fix powerpc build of the MPC ring code



The failed test cases:

7 tests failed.
FAILED:  sys.kern.ssl_sendfile.truncate

Error Message:
Test case body timed out

FAILED:  sys.kern.ssl_sendfile.eagain_vs_eof

Error Message:
/usr/src/tests/sys/kern/ssl_sendfile.c:485: c.sbytes == -1 not met

FAILED:  sys.kern.ssl_sendfile.grow

Error Message:
Test case body timed out

FAILED:  lib.libexecinfo.sigtramp_test.test_backtrace_sigtramp

Error Message:
/usr/src/lib/libexecinfo/tests/sigtramp_test.c:30: n > 1 not met

FAILED:  sys.net.if_lagg_test.witness

Error Message:
Lock-order reversals involving if_lagg.c detected

FAILED:  sys.netinet.udp_bindings.connect_bound_socket_from_2address_jail

Error Message:
/usr/src/tests/sys/netinet/udp_bindings.c:244: connect(s, (struct sockaddr *)&sin, sizeof(sin)) == 0 not met

FAILED:  sys.netlink.netlink_socket.overflow

Error Message:
/usr/src/tests/sys/netlink/netlink_socket.c:146: send(fd, &hdr, sizeof(hdr), 0) == sizeof(hdr) not met