FreeBSD-main-amd64-test - Build #29710 - Still Unstable

From: <jenkins-admin_at_FreeBSD.org>
Date: Fri, 16 Oct 2026 09:32:30 UTC
FreeBSD-main-amd64-test - Build #29710 (b80af977f1b1ab72cb80fe6802228cdae0547efe) - Still Unstable

Build information: https://ci.FreeBSD.org/job/FreeBSD-main-amd64-test/29710/
Full change log: https://ci.FreeBSD.org/job/FreeBSD-main-amd64-test/29710/changes
Full build log: https://ci.FreeBSD.org/job/FreeBSD-main-amd64-test/29710/console

Status explanation:
"Unstable" - some tests are suspected being broken by the following changes
"Still Unstable" - the failing test cases have not been fixed by these
                   following changes and this is a notification to note that
                   these changes have not been fully tested by the CI system

Change summaries:
(Those commits are likely but not certainly responsible)

a6e1dde287eb3854873224200cea40996b0b5cbf by rcm:
pf: Do not corrupt neighbour advertisements when translating

ec68ff15bfa6aece12383ba408e9eec95f4b79cd by br:
mgb: support multi-segment packets in the DMA descriptor rings.

e3d7a9b5ed5f7b0027852dd0a848884fce00b1ee by rmoeller:
mailmap: Add mappings for rmoeller

8fdf03cd361393765cdba00b87e7b6d614a7e80f by rmoeller:
committers-src: Add rmoeller mentored by kevans@

686323c1820cc4b2ef5434c0b6fa0ac38466fe5e by olivier:
if_rge: add debugnet/netdump support

a3c57739ca07c655fbb0f9e7ddd38968186b8a76 by rmoeller:
lib/libifconfig: Fix pointer-sign warnings

33d9fbf5f95301f6eefbbf7e7fd49b4e9c098919 by rmoeller:
linuxulator: Accept 0 as signal in rt_sigqueueinfo

b80af977f1b1ab72cb80fe6802228cdae0547efe by emaste:
mgb: Build module for all archs



The failed test cases:

7 tests failed.
FAILED:  sys.kern.ssl_sendfile.truncate

Error Message:
Test case body timed out

FAILED:  sys.kern.ssl_sendfile.eagain_vs_eof

Error Message:
/usr/src/tests/sys/kern/ssl_sendfile.c:485: c.sbytes == -1 not met

FAILED:  sys.kern.ssl_sendfile.grow

Error Message:
Test case body timed out

FAILED:  lib.libexecinfo.sigtramp_test.test_backtrace_sigtramp

Error Message:
/usr/src/lib/libexecinfo/tests/sigtramp_test.c:30: n > 1 not met

FAILED:  sys.net.if_lagg_test.witness

Error Message:
Lock-order reversals involving if_lagg.c detected

FAILED:  sys.netinet.udp_bindings.connect_bound_socket_from_2address_jail

Error Message:
/usr/src/tests/sys/netinet/udp_bindings.c:244: connect(s, (struct sockaddr *)&sin, sizeof(sin)) == 0 not met

FAILED:  sys.netlink.netlink_socket.overflow

Error Message:
/usr/src/tests/sys/netlink/netlink_socket.c:146: send(fd, &hdr, sizeof(hdr), 0) == sizeof(hdr) not met