FreeBSD-stable-14-amd64-test - Build #2181 - Still Unstable
- In reply to: jenkins-admin_a_FreeBSD.org: "FreeBSD-stable-14-amd64-test - Build #2180 - Still Unstable"
- Go to: [ bottom of page ] [ top of archives ] [ this month ]
Date: Sat, 03 Oct 2026 17:24:41 UTC
FreeBSD-stable-14-amd64-test - Build #2181 (8b360b405ccca12ebdc9509049d9bccad4074e1e) - Still Unstable
Build information: https://ci.FreeBSD.org/job/FreeBSD-stable-14-amd64-test/2181/
Full change log: https://ci.FreeBSD.org/job/FreeBSD-stable-14-amd64-test/2181/changes
Full build log: https://ci.FreeBSD.org/job/FreeBSD-stable-14-amd64-test/2181/console
Status explanation:
"Unstable" - some tests are suspected being broken by the following changes
"Still Unstable" - the failing test cases have not been fixed by these
following changes and this is a notification to note that
these changes have not been fully tested by the CI system
Change summaries:
(Those commits are likely but not certainly responsible)
8b360b405ccca12ebdc9509049d9bccad4074e1e by dch:
release: Avoid generating .pkgsave files in OCI images
The failed test cases:
5 tests failed.
FAILED: sys.netpfil.common.dummynet.ipfw_queue
Error Message:
We failed prioritisation 1 times
FAILED: sys.netpfil.pf.pfsync.bulk
Error Message:
state not found on synced host
FAILED: sys.pmc.pmc_api_test.another_owners_id
Error Message:
1 checks failed; see output for more details
FAILED: sys.pmc.pmc_api_test.never_allocated_id
Error Message:
3 checks failed; see output for more details
FAILED: sys.pmc.pmc_api_test.released_id
Error Message:
1 checks failed; see output for more details