FreeBSD-stable-14-amd64-test - Build #2180 - Still Unstable

From: <jenkins-admin_at_FreeBSD.org>
Date: Sat, 03 Oct 2026 14:55:37 UTC
FreeBSD-stable-14-amd64-test - Build #2180 (4c46d1aac7831da0c31b10d99dfd0780b1972ab9) - Still Unstable

Build information: https://ci.FreeBSD.org/job/FreeBSD-stable-14-amd64-test/2180/
Full change log: https://ci.FreeBSD.org/job/FreeBSD-stable-14-amd64-test/2180/changes
Full build log: https://ci.FreeBSD.org/job/FreeBSD-stable-14-amd64-test/2180/console

Status explanation:
"Unstable" - some tests are suspected being broken by the following changes
"Still Unstable" - the failing test cases have not been fixed by these
                   following changes and this is a notification to note that
                   these changes have not been fully tested by the CI system

Change summaries:
(Those commits are likely but not certainly responsible)

4c46d1aac7831da0c31b10d99dfd0780b1972ab9 by novel:
bhyveload: do not hang on EOF from console input



The failed test cases:

5 tests failed.
FAILED:  sys.netinet6.ndp.ndp_prefix_lifetime_extend

Error Message:
Expiry time was shortened: 20 <= 19

FAILED:  sys.netpfil.pf.pfsync.bulk

Error Message:
state not found on synced host

FAILED:  sys.pmc.pmc_api_test.another_owners_id

Error Message:
1 checks failed; see output for more details

FAILED:  sys.pmc.pmc_api_test.never_allocated_id

Error Message:
3 checks failed; see output for more details

FAILED:  sys.pmc.pmc_api_test.released_id

Error Message:
1 checks failed; see output for more details