FreeBSD-stable-14-amd64-test - Build #2179 - Still Unstable

From: <jenkins-admin_at_FreeBSD.org>
Date: Sat, 03 Oct 2026 10:41:40 UTC
FreeBSD-stable-14-amd64-test - Build #2179 (7b8c8057225692601ce8512da5d4038b179ec22c) - Still Unstable

Build information: https://ci.FreeBSD.org/job/FreeBSD-stable-14-amd64-test/2179/
Full change log: https://ci.FreeBSD.org/job/FreeBSD-stable-14-amd64-test/2179/changes
Full build log: https://ci.FreeBSD.org/job/FreeBSD-stable-14-amd64-test/2179/console

Status explanation:
"Unstable" - some tests are suspected being broken by the following changes
"Still Unstable" - the failing test cases have not been fixed by these
                   following changes and this is a notification to note that
                   these changes have not been fully tested by the CI system

Change summaries:
(Those commits are likely but not certainly responsible)

7b8c8057225692601ce8512da5d4038b179ec22c by philip:
contrib/tzdata: import tzdata 2026e



The failed test cases:

6 tests failed.
FAILED:  sys.kqueue.libkqueue.kqueue_test.main

Error Message:
Returned non-success exit status 1

FAILED:  sys.netpfil.common.dummynet.pf_queue

Error Message:
We failed prioritisation 1 times

FAILED:  sys.netpfil.pf.pfsync.bulk

Error Message:
state not found on synced host

FAILED:  sys.pmc.pmc_api_test.another_owners_id

Error Message:
1 checks failed; see output for more details

FAILED:  sys.pmc.pmc_api_test.never_allocated_id

Error Message:
3 checks failed; see output for more details

FAILED:  sys.pmc.pmc_api_test.released_id

Error Message:
1 checks failed; see output for more details