FreeBSD-stable-14-amd64-test - Build #2182 - Still Unstable

From: <jenkins-admin_at_FreeBSD.org>
Date: Mon, 05 Oct 2026 17:17:47 UTC
FreeBSD-stable-14-amd64-test - Build #2182 (2082f443dda8f7f2bbe21ddee7c88af809348c78) - Still Unstable

Build information: https://ci.FreeBSD.org/job/FreeBSD-stable-14-amd64-test/2182/
Full change log: https://ci.FreeBSD.org/job/FreeBSD-stable-14-amd64-test/2182/changes
Full build log: https://ci.FreeBSD.org/job/FreeBSD-stable-14-amd64-test/2182/console

Status explanation:
"Unstable" - some tests are suspected being broken by the following changes
"Still Unstable" - the failing test cases have not been fixed by these
                   following changes and this is a notification to note that
                   these changes have not been fully tested by the CI system

Change summaries:
(Those commits are likely but not certainly responsible)

2febf35c90207493026ef16014b353548a375d0f by ziaee:
bcm2835_pwm: Fix dev.pwm.0.ratio2 register

3b593364a92e1316c80f65550a78a5fe40e9f8c7 by ziaee:
ng manpages: Standardize descriptions

514bd4465001c5d57a9dda605d00f934f8ca4e91 by ziaee:
rc.conf.5: Improve NOAUTO configuration + tag SPDX

dcab58551115b2299e4b0f23e26fc0b763d7cf32 by emaste:
secure: Rearrange Makefile SRCS to match upstream Makefile.in

0dfc112ac722b1f0437c198f6b58a2536e69be49 by emaste:
openssh: Remove residual blank line at start of Makefile

b690ed49ffd0d7467789badb742e977aff1406b7 by emaste:
openssh: Add reference for another local patch

2082f443dda8f7f2bbe21ddee7c88af809348c78 by emaste:
openssh: Add date bump command to FREEBSD-upgrade instructions



The failed test cases:

6 tests failed.
FAILED:  sys.kern.ptrace_test.ptrace__follow_fork_child_detached_unrelated_debugger

Error Message:
/usr/src/tests/sys/kern/ptrace_test.c:592: WIFSTOPPED(status) not met

FAILED:  usr.bin.procstat.procstat_test.environment

Error Message:
atf-check failed; see the output of the test for details

FAILED:  sys.netpfil.pf.pfsync.bulk

Error Message:
state not found on synced host

FAILED:  sys.pmc.pmc_api_test.another_owners_id

Error Message:
1 checks failed; see output for more details

FAILED:  sys.pmc.pmc_api_test.never_allocated_id

Error Message:
3 checks failed; see output for more details

FAILED:  sys.pmc.pmc_api_test.released_id

Error Message:
1 checks failed; see output for more details