FreeBSD-stable-14-amd64-test - Build #2176 - Still Unstable

From: <jenkins-admin_at_FreeBSD.org>
Date: Thu, 01 Oct 2026 10:58:42 UTC
FreeBSD-stable-14-amd64-test - Build #2176 (c09c4b1560dea4382095c2f7505f5eb2c9b7f0ef) - Still Unstable

Build information: https://ci.FreeBSD.org/job/FreeBSD-stable-14-amd64-test/2176/
Full change log: https://ci.FreeBSD.org/job/FreeBSD-stable-14-amd64-test/2176/changes
Full build log: https://ci.FreeBSD.org/job/FreeBSD-stable-14-amd64-test/2176/console

Status explanation:
"Unstable" - some tests are suspected being broken by the following changes
"Still Unstable" - the failing test cases have not been fixed by these
                   following changes and this is a notification to note that
                   these changes have not been fully tested by the CI system

Change summaries:
(Those commits are likely but not certainly responsible)

f3a42111ec5985c0bfbca32f999921641ec10b01 by ngie:
contrib/lutok: update from 0.4 to 0.6.2

c09c4b1560dea4382095c2f7505f5eb2c9b7f0ef by ngie:
contrib/lutok: remove autotools generated files



The failed test cases:

4 tests failed.
FAILED:  usr.bin.xinstall.install_test.stdin

Error Message:
atf-check failed; see the output of the test for details

FAILED:  sys.pmc.pmc_api_test.another_owners_id

Error Message:
1 checks failed; see output for more details

FAILED:  sys.pmc.pmc_api_test.never_allocated_id

Error Message:
3 checks failed; see output for more details

FAILED:  sys.pmc.pmc_api_test.released_id

Error Message:
1 checks failed; see output for more details