FreeBSD-stable-14-amd64-test - Build #2175 - Still Unstable

From: <jenkins-admin_at_FreeBSD.org>
Date: Thu, 01 Oct 2026 08:55:01 UTC
FreeBSD-stable-14-amd64-test - Build #2175 (220e946f3f333239798a3b231406d121720899b9) - Still Unstable

Build information: https://ci.FreeBSD.org/job/FreeBSD-stable-14-amd64-test/2175/
Full change log: https://ci.FreeBSD.org/job/FreeBSD-stable-14-amd64-test/2175/changes
Full build log: https://ci.FreeBSD.org/job/FreeBSD-stable-14-amd64-test/2175/console

Status explanation:
"Unstable" - some tests are suspected being broken by the following changes
"Still Unstable" - the failing test cases have not been fixed by these
                   following changes and this is a notification to note that
                   these changes have not been fully tested by the CI system

Change summaries:
(Those commits are likely but not certainly responsible)

517d051b81f1fd11f34157bc5489ee803b2c9a75 by netchild:
hwpmc tests: sort the list of test programs

d5a5e414c32db06f3dab18ab2135d51bd829af39 by netchild:
hwpmc: add regression tests for a credential-changing exec

198c334c198393ebd9d781c24e9dfd68f9065343 by netchild:
hwpmc: add tests for handle validation and the privilege boundaries

81ddb2e0156930052e87c2d9778d64041f16bb7b by netchild:
hwpmc tests: process-attachment lifecycle and ownership cases

4a82521f9a113074a4537bc757112db3a284737f by netchild:
hwpmc: add credential-transition exec tests (keep and drop)

b32597a90dfbcb8c8448b7ee6f853935c5df3e8d by netchild:
hwpmc tests: the sampling log file

56a4abe124de6baf9ba1004893651ec210fa2a3e by pkubaj:
llan: byte swap the receive queue entries

220e946f3f333239798a3b231406d121720899b9 by ngie:
asmc.4: clean up/modernize manpage



The failed test cases:

3 tests failed.
FAILED:  sys.pmc.pmc_api_test.another_owners_id

Error Message:
1 checks failed; see output for more details

FAILED:  sys.pmc.pmc_api_test.never_allocated_id

Error Message:
3 checks failed; see output for more details

FAILED:  sys.pmc.pmc_api_test.released_id

Error Message:
1 checks failed; see output for more details