FreeBSD-stable-14-amd64-test - Build #2177 - Still Unstable

From: <jenkins-admin_at_FreeBSD.org>
Date: Fri, 02 Oct 2026 07:47:06 UTC
FreeBSD-stable-14-amd64-test - Build #2177 (ec3ebfaf9fd37ab937141f6b4fca548b1c9173a3) - Still Unstable

Build information: https://ci.FreeBSD.org/job/FreeBSD-stable-14-amd64-test/2177/
Full change log: https://ci.FreeBSD.org/job/FreeBSD-stable-14-amd64-test/2177/changes
Full build log: https://ci.FreeBSD.org/job/FreeBSD-stable-14-amd64-test/2177/console

Status explanation:
"Unstable" - some tests are suspected being broken by the following changes
"Still Unstable" - the failing test cases have not been fixed by these
                   following changes and this is a notification to note that
                   these changes have not been fully tested by the CI system

Change summaries:
(Those commits are likely but not certainly responsible)

1fadced1c8695631b363bc56a06123bd8111d9bf by 0mp:
sdiff.1: Document exit status and --help

3be409a395e503f03e6ee35eec112038b1b722b8 by markj:
mac_bsdextended: reject negative rule indices in sysctl_rule()

d1b49810e8c8872e96e35dc4e5635af73679c61e by markj:
ppp: Fix address leaks

c3b8e0bb8b3980c09204556f63a6fbdabe43a234 by markj:
vm_page: Fix the error path in vm_page_alloc_contig_domain()

f117b6ba9f7ccea25a105471478b81e0438a3082 by markj:
lockf: Do not block in vfs_busy()

74152f84fa4c4421da9d8ebf528e129ea2437c9a by dim:
llvm: remove Mips target support

2ccc24409759cf1f7fb0d67ef429da9dd40f6ff8 by ngie:
crypto/openssl: upgrade to 3.0.22

ec3ebfaf9fd37ab937141f6b4fca548b1c9173a3 by delphij:
MFC: fsck_msdosfs: fix head bitmap over-allocation on 32-bit platforms



The failed test cases:

6 tests failed.
FAILED:  sys.geom.class.gate.ggate_test.ggated

Error Message:
atf-check failed; see the output of the test for details

FAILED:  sys.kern.ptrace_test.ptrace__follow_fork_both_attached_unrelated_debugger

Error Message:
/usr/src/tests/sys/kern/ptrace_test.c:592: WIFSTOPPED(status) not met

FAILED:  sys.netinet6.ndp.ndp_prefix_lifetime_extend

Error Message:
Expiry time was shortened: 20 <= 19

FAILED:  sys.pmc.pmc_api_test.another_owners_id

Error Message:
1 checks failed; see output for more details

FAILED:  sys.pmc.pmc_api_test.never_allocated_id

Error Message:
3 checks failed; see output for more details

FAILED:  sys.pmc.pmc_api_test.released_id

Error Message:
1 checks failed; see output for more details