FreeBSD-main-amd64-test - Build #25179 - Still Unstable

From: <>
Date: Tue, 30 Apr 2024 00:53:51 UTC
FreeBSD-main-amd64-test - Build #25179 (2965ae59144177eb3570721295da9cbc447f1105) - Still Unstable

Build information:
Full change log:
Full build log:

Status explanation:
"Unstable" - some tests are suspected being broken by the following changes
"Still Unstable" - the failing test cases have not been fixed by these
                   following changes and this is a notification to note that
                   these changes have not been fully tested by the CI system

Change summaries:
(Those commits are likely but not certainly responsible)

f0ee6112eb61a5130acedd20d9827627c0975fba by np:
cxgbe(4): Add missing description for a port type.

43f6f08488046788b0ad66e9a5119f36e5de71ab by np:
cxgbe(4): Reword the comment explaining the atid/cookie split.

2965ae59144177eb3570721295da9cbc447f1105 by np:
cxgbe(4): Shared code update to deal with partial failure in

The failed test cases:

3 tests failed.
FAILED:  usr.bin.unzip.functional_test.test_I

Error Message:
atf-check failed; see the output of the test for details

FAILED:  sys.kern.unix_seqpacket_test.random_eor_and_waitall

Error Message:
/usr/src/tests/sys/kern/unix_seqpacket_test.c:1182: send(params->sock, &params->sendbuf[off], len, flags) == len not met

FAILED:  sys.netinet6.divert.ipdivert_ip6_output_remote_success

Error Message:
1 != 0 (1 != 0)