FreeBSD-main-amd64-test - Build #25180 - Still Unstable

From: <>
Date: Tue, 30 Apr 2024 03:47:23 UTC
FreeBSD-main-amd64-test - Build #25180 (6a7819e43f938992304472054c83f4a6602a9e19) - Still Unstable

Build information:
Full change log:
Full build log:

Status explanation:
"Unstable" - some tests are suspected being broken by the following changes
"Still Unstable" - the failing test cases have not been fixed by these
                   following changes and this is a notification to note that
                   these changes have not been fully tested by the CI system

Change summaries:
(Those commits are likely but not certainly responsible)

d1cd0cc32b53c09e72e33116b94a5b0b9781a183 by kib:
rtld: add direct-exec option -o

ef2694f368cee5957ee44b0298da88ff8360d561 by kib:
rtld direct exec: make -u behavior match the description

6a7819e43f938992304472054c83f4a6602a9e19 by kib:
rtld.1: clarify interaction between -u and -o

The failed test cases:

3 tests failed.
FAILED:  usr.bin.unzip.functional_test.test_I

Error Message:
atf-check failed; see the output of the test for details

FAILED:  sys.kern.unix_seqpacket_test.random_eor_and_waitall

Error Message:
/usr/src/tests/sys/kern/unix_seqpacket_test.c:1182: send(params->sock, &params->sendbuf[off], len, flags) == len not met

FAILED:  sys.netinet6.divert.ipdivert_ip6_output_remote_success

Error Message:
1 != 0 (1 != 0)