FreeBSD-main-amd64-test - Build #25178 - Still Unstable

From: <>
Date: Mon, 29 Apr 2024 23:22:26 UTC
FreeBSD-main-amd64-test - Build #25178 (1c7f9c8b4673abf3723be09afed4443261e0d186) - Still Unstable

Build information:
Full change log:
Full build log:

Status explanation:
"Unstable" - some tests are suspected being broken by the following changes
"Still Unstable" - the failing test cases have not been fixed by these
                   following changes and this is a notification to note that
                   these changes have not been fully tested by the CI system

Change summaries:
(Those commits are likely but not certainly responsible)

b59c5d97edf17525405d95b1f5746c4a79a9c7c4 by np:
cxgbe(4): Add a helper function to locate MPS/MAC registers.

1c7f9c8b4673abf3723be09afed4443261e0d186 by np:
cxgbe(4): Retire t4_intr_clear.

The failed test cases:

3 tests failed.
FAILED:  usr.bin.unzip.functional_test.test_I

Error Message:
atf-check failed; see the output of the test for details

FAILED:  sys.kern.unix_seqpacket_test.random_eor_and_waitall

Error Message:
/usr/src/tests/sys/kern/unix_seqpacket_test.c:1182: send(params->sock, &params->sendbuf[off], len, flags) == len not met

FAILED:  sys.netinet6.divert.ipdivert_ip6_output_remote_success

Error Message:
1 != 0 (1 != 0)