FreeBSD-main-amd64-test - Build #25158 - Still Unstable

From: <>
Date: Thu, 25 Apr 2024 20:44:38 UTC
FreeBSD-main-amd64-test - Build #25158 (ad31d4764255c0848f1f0fa10760d16b5a2922aa) - Still Unstable

Build information:
Full change log:
Full build log:

Status explanation:
"Unstable" - some tests are suspected being broken by the following changes
"Still Unstable" - the failing test cases have not been fixed by these
                   following changes and this is a notification to note that
                   these changes have not been fully tested by the CI system

Change summaries:
(Those commits are likely but not certainly responsible)

d66399326cb4f89d1565fb62c1c07974886893c5 by markj:
kthread: Set *tdptr earlier in kproc_kthread_add()

514773a5486d1fa4f2d5acb5af1766965c20765b by dim:
Skip building libclang_rt when WITHOUT_CLANG is used

54c3aa02e926268ba5551cd7d28fddf38b3589a2 by rmacklem:
Revert "nfsd: Fix NFSv4.1/4.2 Claim_Deleg_Cur_FH"

f08bf5a3acf146b17794fbde41279645ddbaa086 by dim:
Merge commit 0f329e0246d1 from llvm-project (by Dimitry Andric):

ad31d4764255c0848f1f0fa10760d16b5a2922aa by bz:
bsdinstall: update comment related to pkg

The failed test cases:

3 tests failed.
FAILED:  usr.bin.unzip.functional_test.test_I

Error Message:
atf-check failed; see the output of the test for details

FAILED:  sys.kern.unix_seqpacket_test.random_eor_and_waitall

Error Message:
/usr/src/tests/sys/kern/unix_seqpacket_test.c:1182: send(params->sock, &params->sendbuf[off], len, flags) == len not met

FAILED:  sys.netinet6.divert.ipdivert_ip6_output_remote_success

Error Message:
1 != 0 (1 != 0)