FreeBSD-main-amd64-test - Build #25157 - Still Unstable

From: <>
Date: Thu, 25 Apr 2024 16:33:09 UTC
FreeBSD-main-amd64-test - Build #25157 (42255af64a5471a2668e3a0552d82639e1f70ee4) - Still Unstable

Build information:
Full change log:
Full build log:

Status explanation:
"Unstable" - some tests are suspected being broken by the following changes
"Still Unstable" - the failing test cases have not been fixed by these
                   following changes and this is a notification to note that
                   these changes have not been fully tested by the CI system

Change summaries:
(Those commits are likely but not certainly responsible)

4395d3ced5cfa46df400b5bb9996f9d74476997e by 0mp:
Document that gettimeofday() is obsolescent

177ba183076bd6fe6b29b1d657b954cca256506b by 0mp:
sync.8: Document that the "sync dance" is not a thing

42255af64a5471a2668e3a0552d82639e1f70ee4 by 0mp:
checkstyle9: Allow a space between "*" and _*restrict

The failed test cases:

4 tests failed.
FAILED:  sys.netpfil.common.dummynet.pf_queue

Error Message:
We failed prioritisation 1 times

FAILED:  usr.bin.unzip.functional_test.test_I

Error Message:
atf-check failed; see the output of the test for details

FAILED:  sys.kern.unix_seqpacket_test.random_eor_and_waitall

Error Message:
/usr/src/tests/sys/kern/unix_seqpacket_test.c:1182: send(params->sock, &params->sendbuf[off], len, flags) == len not met

FAILED:  sys.netinet6.divert.ipdivert_ip6_output_remote_success

Error Message:
1 != 0 (1 != 0)