FreeBSD-main-amd64-test - Build #25156 - Still Unstable

From: <>
Date: Thu, 25 Apr 2024 09:14:46 UTC
FreeBSD-main-amd64-test - Build #25156 (19307b86d31b7dea4bb5c3f7e233ee0e59049258) - Still Unstable

Build information:
Full change log:
Full build log:

Status explanation:
"Unstable" - some tests are suspected being broken by the following changes
"Still Unstable" - the failing test cases have not been fixed by these
                   following changes and this is a notification to note that
                   these changes have not been fully tested by the CI system

Change summaries:
(Those commits are likely but not certainly responsible)

c68eed82a3dcadf0c826e9e150f59769f4c44f24 by glebius:
accf_tls: accept filter that waits for TLS handshake header

19307b86d31b7dea4bb5c3f7e233ee0e59049258 by glebius:
accept_filter: return different errors for non-listener and a busy

The failed test cases:

3 tests failed.
FAILED:  usr.bin.unzip.functional_test.test_I

Error Message:
atf-check failed; see the output of the test for details

FAILED:  sys.kern.unix_seqpacket_test.random_eor_and_waitall

Error Message:
/usr/src/tests/sys/kern/unix_seqpacket_test.c:1182: send(params->sock, &params->sendbuf[off], len, flags) == len not met

FAILED:  sys.netinet6.divert.ipdivert_ip6_output_remote_success

Error Message:
1 != 0 (1 != 0)