FreeBSD-main-amd64-test - Build #25155 - Still Unstable

From: <>
Date: Thu, 25 Apr 2024 00:58:03 UTC
FreeBSD-main-amd64-test - Build #25155 (78101d437a92d539584795ffd2c46724da37e662) - Still Unstable

Build information:
Full change log:
Full build log:

Status explanation:
"Unstable" - some tests are suspected being broken by the following changes
"Still Unstable" - the failing test cases have not been fixed by these
                   following changes and this is a notification to note that
                   these changes have not been fully tested by the CI system

Change summaries:
(Those commits are likely but not certainly responsible)

ef80df0a71912500ad84060334a24e903869f00b by andrew:
arm64/vmm: Ensure the tlbi has completed

9d40492efa467095340cf3dca5860880aa441472 by andrew:
arm64: Check DMAP address is valid in PHYS_IN_DMAP

2c35c867ba05c8de167e1597c9044a72febdda63 by andrew:
showconfig: Set MACHINE for

d7ac42676dc403cd31d4a6c9a91a2ed5680cca86 by andrew:
elf_common.h: Add STO_AARCH64_VARIANT_PCS

0135101e23f98205157928dc819ef3bc993a4276 by sjg: do not override start_utc

66df81021e5437e86ff5e0886c35170feb1cd3a0 by kib:
sys/namei.h: move NI_CAP_VIOLATION() macro from namei.h to vfs_lookup.c

6b0cf2a2379b86b67269ed4549057cd6d69490e5 by kib:
vfs_lookup.c: only call ktrcapfail() if KTRACE is enabled

78101d437a92d539584795ffd2c46724da37e662 by brooks:
syscalls.master: correct return type of {read,write}v

The failed test cases:

3 tests failed.
FAILED:  usr.bin.unzip.functional_test.test_I

Error Message:
atf-check failed; see the output of the test for details

FAILED:  sys.kern.unix_seqpacket_test.random_eor_and_waitall

Error Message:
/usr/src/tests/sys/kern/unix_seqpacket_test.c:1182: send(params->sock, &params->sendbuf[off], len, flags) == len not met

FAILED:  sys.netinet6.divert.ipdivert_ip6_output_remote_success

Error Message:
1 != 0 (1 != 0)