FreeBSD-main-amd64-test - Build #25154 - Still Unstable

From: <>
Date: Wed, 24 Apr 2024 19:20:01 UTC
FreeBSD-main-amd64-test - Build #25154 (71b2ba9099115db3c63f15e5085c0a677511f8b8) - Still Unstable

Build information:
Full change log:
Full build log:

Status explanation:
"Unstable" - some tests are suspected being broken by the following changes
"Still Unstable" - the failing test cases have not been fixed by these
                   following changes and this is a notification to note that
                   these changes have not been fully tested by the CI system

Change summaries:
(Those commits are likely but not certainly responsible)

8512311fb5004444f43701eb122b6d77c76d7564 by markj:
ng_pipe: Fix whitespace

bb2ab7a374b9d81f8368acc506c9700af20a22d6 by markj:
ng_pipe: Remove node when all hooks are disconnected

a3ecf8c7863683e53c77a17f96ab7012352265b9 by markj:
ng_pipe: Replace deprecated random() with prng32_bounded()

d44c78074d8738db67a2fa6bf07b630c61eee6ab by markj:
ng_pipe: Do not panic when memory allocations fail

964064937ea04519bd400668dc1ce38848d50901 by markj:
dpaa: uma_zcreate() does not fail

b6a0ed7c78dd45937e404706620467bef61c308d by markj:
wg: uma_zcreate() does not fail

78c51db3c4927db2437ec616b33ba1faf73f08ee by markj:
udf: uma_zcreate() does not fail

1e607a0753ff93847926a46003fe74087426b580 by markj:
khelp: uma_zcreate() does not fail

8ef2c021822f59a334e3926e8505c8a8e8a3475f by markj:
busdma: uma_zcreate() does not fail

4b7949144cfbf25b0e0bf593b135a88417304d71 by asomers:
geli.8: add some notes regarding performance tuning

107584716cdeaa36c718a42861df1cb4b8b87e62 by markj:
bhyve.8: Remove mention of the -A flag

63d5f8c0f25ae0ec17ad902c5ba89644e4bd1019 by markj: Stop passing -A to bhyve

71b2ba9099115db3c63f15e5085c0a677511f8b8 by markj:
bhyve.8: Document arm64 support

The failed test cases:

4 tests failed.
FAILED:  sys.netpfil.common.dummynet.ipfw_pls_gilbert

Error Message:
atf-check failed; see the output of the test for details

FAILED:  usr.bin.unzip.functional_test.test_I

Error Message:
atf-check failed; see the output of the test for details

FAILED:  sys.kern.unix_seqpacket_test.random_eor_and_waitall

Error Message:
/usr/src/tests/sys/kern/unix_seqpacket_test.c:1269: data corruption past 20578

FAILED:  sys.netinet6.divert.ipdivert_ip6_output_remote_success

Error Message:
1 != 0 (1 != 0)