FreeBSD-main-amd64-test - Build #25153 - Still Unstable

From: <>
Date: Wed, 24 Apr 2024 11:38:37 UTC
FreeBSD-main-amd64-test - Build #25153 (a0d7d68a2dd818ce84e37e1ff20c8849cda6d853) - Still Unstable

Build information:
Full change log:
Full build log:

Status explanation:
"Unstable" - some tests are suspected being broken by the following changes
"Still Unstable" - the failing test cases have not been fixed by these
                   following changes and this is a notification to note that
                   these changes have not been fully tested by the CI system

Change summaries:
(Those commits are likely but not certainly responsible)

e8ec4b5d1202d935bcc6ed75c361b618e8da627f by delphij:
less: Do not trust st_size if it equals zero

9e248b7f645cdf05615a49cc15295df49b54d659 by cy:
kdc: Add restart option

a0d7d68a2dd818ce84e37e1ff20c8849cda6d853 by cy:
heimdal: Fix compiling hdb ldap as a module

The failed test cases:

3 tests failed.
FAILED:  usr.bin.unzip.functional_test.test_I

Error Message:
atf-check failed; see the output of the test for details

FAILED:  sys.kern.unix_seqpacket_test.random_eor_and_waitall

Error Message:
/usr/src/tests/sys/kern/unix_seqpacket_test.c:1182: send(params->sock, &params->sendbuf[off], len, flags) == len not met

FAILED:  sys.netinet6.divert.ipdivert_ip6_output_remote_success

Error Message:
1 != 0 (1 != 0)