FreeBSD-main-amd64-test - Build #25159 - Still Unstable

From: <>
Date: Fri, 26 Apr 2024 02:50:07 UTC
FreeBSD-main-amd64-test - Build #25159 (8efba70d7914324890b1f8fe3079036eb2b5c3db) - Still Unstable

Build information:
Full change log:
Full build log:

Status explanation:
"Unstable" - some tests are suspected being broken by the following changes
"Still Unstable" - the failing test cases have not been fixed by these
                   following changes and this is a notification to note that
                   these changes have not been fully tested by the CI system

Change summaries:
(Those commits are likely but not certainly responsible)

73585176ffd84c13d68cad67c2ca81643f09075c by zlei:
if_bridge: Minor style fixes

1ed44fcc44b2c04db330663589541608135402f4 by des:
tftpd: Use `size_t` where appropriate.

7ab7ecfcfe777f7816e3e01df5f277060b2b609a by des:
tftpd: Clean up the tests.

83a6e984ac01657819418746f722163367ec30db by des:
tftpd: Check the server status after each test.

9f231af307b80eb222d9761bbd81fa4e130bb3d7 by des:
tftpd: Immediately reject any request shorter than 4 bytes.

8efba70d7914324890b1f8fe3079036eb2b5c3db by rmacklem:
nfscl: Revert part of commit 196787f79e67

The failed test cases:

3 tests failed.
FAILED:  usr.bin.unzip.functional_test.test_I

Error Message:
atf-check failed; see the output of the test for details

FAILED:  sys.kern.unix_seqpacket_test.random_eor_and_waitall

Error Message:
/usr/src/tests/sys/kern/unix_seqpacket_test.c:1182: send(params->sock, &params->sendbuf[off], len, flags) == len not met

FAILED:  sys.netinet6.divert.ipdivert_ip6_output_remote_success

Error Message:
1 != 0 (1 != 0)