FreeBSD-main-amd64-test - Build #25144 - Still Unstable

From: <>
Date: Mon, 22 Apr 2024 06:26:14 UTC
FreeBSD-main-amd64-test - Build #25144 (dd03eafacba962c9dcec929c3ed9d63e7c43da3a) - Still Unstable

Build information:
Full change log:
Full build log:

Status explanation:
"Unstable" - some tests are suspected being broken by the following changes
"Still Unstable" - the failing test cases have not been fixed by these
                   following changes and this is a notification to note that
                   these changes have not been fully tested by the CI system

Change summaries:
(Those commits are likely but not certainly responsible)

0ab121e9f9a33dde06b292df02ec2eee03033e1f by dim:
Add a few missed libclang_rt files to

10e0c34bf842885b4bd78adbbdbd7fb00f133cb5 by emaste:
Enable L1SS handling on RPI4 pcib

dd03eafacba962c9dcec929c3ed9d63e7c43da3a by dougm:
riscv: create a convenience composite macro

The failed test cases:

3 tests failed.
FAILED:  usr.bin.unzip.functional_test.test_I

Error Message:
atf-check failed; see the output of the test for details

FAILED:  sys.kern.unix_seqpacket_test.random_eor_and_waitall

Error Message:
/usr/src/tests/sys/kern/unix_seqpacket_test.c:1266: recvmsg() spurious EOR at 17128, expected 20644

FAILED:  sys.netinet6.divert.ipdivert_ip6_output_remote_success

Error Message:
1 != 0 (1 != 0)