FreeBSD-main-amd64-test - Build #25143 - Still Unstable

From: <>
Date: Sun, 21 Apr 2024 21:59:54 UTC
FreeBSD-main-amd64-test - Build #25143 (572948d00ddfea1dbd2cba9117b36fc3c47ca444) - Still Unstable

Build information:
Full change log:
Full build log:

Status explanation:
"Unstable" - some tests are suspected being broken by the following changes
"Still Unstable" - the failing test cases have not been fixed by these
                   following changes and this is a notification to note that
                   these changes have not been fully tested by the CI system

Change summaries:
(Those commits are likely but not certainly responsible)

793745fad866f65863ab3b16a17bdf18dc779efd by emaste:
mfc-candidates: move pretty printing into lua

b571bcea5495327fd210378109b0b2aed08bebc3 by ngie: improve `SUBDIR.${MK_FOO}` advice

42ce242e353065dfbaa248955f6657005a395a95 by ngie:
OpenSSL: use the upstream provided files for the fips/legacy

572948d00ddfea1dbd2cba9117b36fc3c47ca444 by ngie:
Revert "OpenSSL: use the upstream provided files for the

The failed test cases:

3 tests failed.
FAILED:  usr.bin.unzip.functional_test.test_I

Error Message:
atf-check failed; see the output of the test for details

FAILED:  sys.kern.unix_seqpacket_test.random_eor_and_waitall

Error Message:
/usr/src/tests/sys/kern/unix_seqpacket_test.c:1182: send(params->sock, &params->sendbuf[off], len, flags) == len not met

FAILED:  sys.netinet6.divert.ipdivert_ip6_output_remote_success

Error Message:
1 != 0 (1 != 0)