FreeBSD-main-amd64-test - Build #25142 - Still Unstable

From: <>
Date: Sun, 21 Apr 2024 16:08:20 UTC
FreeBSD-main-amd64-test - Build #25142 (b9827c007a7a39c7aeef73f8efc217b7b0099464) - Still Unstable

Build information:
Full change log:
Full build log:

Status explanation:
"Unstable" - some tests are suspected being broken by the following changes
"Still Unstable" - the failing test cases have not been fixed by these
                   following changes and this is a notification to note that
                   these changes have not been fully tested by the CI system

Change summaries:
(Those commits are likely but not certainly responsible)

8b5c5cae92d5b44f03636540a787fd6e994ce816 by gbe:
vmm(4): Fix a typo in a kernel message

026520a5f2d2ec01e19494c37b87448df86ef21a by gbe:
wtap: Fix typos in kernel messages

c0a01ee83d3d4749ac9e7e46d8d47b991c65537f by gbe:
geom(4): Fix a typo in a source code comment

9576fc16ca6cb360e085735dfaf891ae6d7f6181 by gbe:
uipc_domain: Fix a typo in a source code comment

26f6c148bce2d6734a07ea621616724f1e76e4fd by gbe:
freescale: Fix a typo in a source code comment

b9827c007a7a39c7aeef73f8efc217b7b0099464 by avg:
Revert "dtrace: make 'ring' and 'fill' policies imply 'noswitch' flag"

The failed test cases:

3 tests failed.
FAILED:  usr.bin.unzip.functional_test.test_I

Error Message:
atf-check failed; see the output of the test for details

FAILED:  sys.kern.unix_seqpacket_test.random_eor_and_waitall

Error Message:
/usr/src/tests/sys/kern/unix_seqpacket_test.c:1269: data corruption past 569

FAILED:  sys.netinet6.divert.ipdivert_ip6_output_remote_success

Error Message:
1 != 0 (1 != 0)