FreeBSD-main-amd64-test - Build #25141 - Still unstable

From: <>
Date: Sun, 21 Apr 2024 05:52:04 UTC
FreeBSD-main-amd64-test - Build #25141 (9dcf39575efb2ff32f955d9e04e04af28d45d798) - Still unstable

Build information:
Full change log:
Full build log:

Status explanation:
"Unstable" - some tests are suspected being broken by the following changes
"Still Unstable" - the failing test cases have not been fixed by these
                   following changes and this is a notification to note that
                   these changes have not been fully tested by the CI system

Change summaries:
(Those commits are likely but not certainly responsible)

b5e0cc2fa44f52f16fc0b9c3f1709bc0f43fe2d0 by kevans:
ahc(4): resolve some minor nits

9dcf39575efb2ff32f955d9e04e04af28d45d798 by kevans:
ahc(4)/ahd(4): fix target mode on ARM

The failed test cases:

4 tests failed.
FAILED:  sys.netpfil.common.dummynet.pf_queue

Error Message:
We failed prioritisation 1 times

FAILED:  usr.bin.unzip.functional_test.test_I

Error Message:
atf-check failed; see the output of the test for details

FAILED:  sys.kern.unix_seqpacket_test.random_eor_and_waitall

Error Message:
/usr/src/tests/sys/kern/unix_seqpacket_test.c:1182: send(params->sock, &params->sendbuf[off], len, flags) == len not met

FAILED:  sys.netinet6.divert.ipdivert_ip6_output_remote_success

Error Message:
1 != 0 (1 != 0)