FreeBSD-main-amd64-test - Build #25145 - Still Unstable

From: <>
Date: Mon, 22 Apr 2024 20:16:53 UTC
FreeBSD-main-amd64-test - Build #25145 (ef84dd8f4926304306d5989ca9afdbf760c6d813) - Still Unstable

Build information:
Full change log:
Full build log:

Status explanation:
"Unstable" - some tests are suspected being broken by the following changes
"Still Unstable" - the failing test cases have not been fixed by these
                   following changes and this is a notification to note that
                   these changes have not been fully tested by the CI system

Change summaries:
(Those commits are likely but not certainly responsible)

800da341bc4a35f4b4d82d104b130825d9a42ffa by markj:
thread: Simplify sanitizer integration with thread creation

7f7b4926a779845116913c85ecbb10527daeab02 by markj:
ng_hci: Add sockaddr validation to sendto()

ef84dd8f4926304306d5989ca9afdbf760c6d813 by markj:
if_bridge: clean up INET/INET6 handling

The failed test cases:

3 tests failed.
FAILED:  usr.bin.unzip.functional_test.test_I

Error Message:
atf-check failed; see the output of the test for details

FAILED:  sys.kern.unix_seqpacket_test.random_eor_and_waitall

Error Message:
/usr/src/tests/sys/kern/unix_seqpacket_test.c:1182: send(params->sock, &params->sendbuf[off], len, flags) == len not met

FAILED:  sys.netinet6.divert.ipdivert_ip6_output_remote_success

Error Message:
1 != 0 (1 != 0)