FreeBSD-main-amd64-test - Build #25130 - Still Unstable

From: <>
Date: Fri, 19 Apr 2024 00:46:00 UTC
FreeBSD-main-amd64-test - Build #25130 (f697b9d03d998da8ec69f2028dd7702a42adc3fc) - Still Unstable

Build information:
Full change log:
Full build log:

Status explanation:
"Unstable" - some tests are suspected being broken by the following changes
"Still Unstable" - the failing test cases have not been fixed by these
                   following changes and this is a notification to note that
                   these changes have not been fully tested by the CI system

Change summaries:
(Those commits are likely but not certainly responsible)

9dfe484e126d0e477a0d79b3f7a2350af9f5e025 by mhorne:
hier.7: polish entry to system manual

f115e03a47b971ac639568dd5f349569527b8782 by mhorne:
intro(7): add link to new networking(7)

cb9d4bb1fbb9ac0eb9f211656e91f9d5254c166c by bofh:
Add preliminary in-tree CI infrastructure for developers

2fd73b7126d7d7e5701e001af929411ce7a0c5f1 by dim:
share/mk/ add F16C feature for i386 and amd64 architectures

ede456359e55958ab17ac665e5867674a0c0e81b by emaste:
CONTRIBUTING: mention sys/crypto as another "contrib" directory

67783db661f88cf5259c19bb59ddee9e076007ac by emaste:
CONTRIBUTING: request only one submission type per change

806bd5e00658e66a5625397335cafa4748112f14 by 0mp: Fix typos

c9cd686bd4a039c652ed5d11019bae10828329df by tuexen:
tcp: drop data received after a FIN has been processed

1941914d3bb41b9e29a250d876ed8814b7b91f96 by tuexen:
tcp rack: improve BBR_LOG_CWND event

d0032e6a9e6596302bf129d7f68a627a02c6cd0a by christos:
sound: Be more verbose with virtual channel descriptions

41ab202ff74ea6af7e9125c9dfb430c729380f41 by christos:
sound: Call device_get_name() and device_get_unit() only once in

4d2be7be3837d66ba242a0a7fd51632c3f89285d by christos:
sound: Get rid of snddev_info->devcount

17969e696325273e250a1dc73f43de76c0836aae by christos:
sound: Remove obsolete chn_setvolume()

8b97dce6973ca1b6c3407c34c76d459f43ca1061 by christos:
sound: Remove PCMMINOR()

a44c45c7f597d67d37e09396b0778a2847a30981 by christos:
sound: Simplify unit fetching in dsp_oss_audioinfo()

1b82d425ec0ac155765bcdf706040534309e9c94 by christos:
sound: Remove obsolete DV_F_* flags

f697b9d03d998da8ec69f2028dd7702a42adc3fc by sjg:
Update set default DEP_*

The failed test cases:

3 tests failed.
FAILED:  usr.bin.unzip.functional_test.test_I

Error Message:
atf-check failed; see the output of the test for details

FAILED:  sys.kern.unix_seqpacket_test.random_eor_and_waitall

Error Message:
/usr/src/tests/sys/kern/unix_seqpacket_test.c:1263: recvmsg() past EOR: 4704, expected 1500

FAILED:  sys.netinet6.divert.ipdivert_ip6_output_remote_success

Error Message:
1 != 0 (1 != 0)