FreeBSD-main-amd64-test - Build #25131 - Still Unstable

From: <>
Date: Fri, 19 Apr 2024 06:57:15 UTC
FreeBSD-main-amd64-test - Build #25131 (e411b2273603267dbc51c7839879e765b573c1c5) - Still Unstable

Build information:
Full change log:
Full build log:

Status explanation:
"Unstable" - some tests are suspected being broken by the following changes
"Still Unstable" - the failing test cases have not been fixed by these
                   following changes and this is a notification to note that
                   these changes have not been fully tested by the CI system

Change summaries:
(Those commits are likely but not certainly responsible)

3c7da27a473e339392121404e06c506df040c16f by erj:
iflib: Add sysctl to request extra MSIX vectors on driver load

ed34a6b6eab9ea39759ccd3f12876a815d271929 by erj:
iflib: Add subinterface interrupt allocation function

015f8cc5b0c10336a048f37a7071ea03516de242 by erj:
ice(4): Update copyright year to 2024

9e54973fc33aa44b77d1c851cb36fcd82dc44cda by erj:
ice(4): Update to 1.39.13-k

e411b2273603267dbc51c7839879e765b573c1c5 by markj:
uipc_shm: Fix a free() of an uninitialized variable

The failed test cases:

4 tests failed.

Error Message:
/usr/local/lib/python3.9/multiprocessing/ EOFError

FAILED:  usr.bin.unzip.functional_test.test_I

Error Message:
atf-check failed; see the output of the test for details

FAILED:  sys.kern.unix_seqpacket_test.random_eor_and_waitall

Error Message:
/usr/src/tests/sys/kern/unix_seqpacket_test.c:1182: send(params->sock, &params->sendbuf[off], len, flags) == len not met

FAILED:  sys.netinet6.divert.ipdivert_ip6_output_remote_success

Error Message:
1 != 0 (1 != 0)