FreeBSD-main-amd64-test - Build #25129 - Still Unstable

From: <>
Date: Thu, 18 Apr 2024 19:33:13 UTC
FreeBSD-main-amd64-test - Build #25129 (464b1ab216d5f78054626524addf99f5c622da96) - Still Unstable

Build information:
Full change log:
Full build log:

Status explanation:
"Unstable" - some tests are suspected being broken by the following changes
"Still Unstable" - the failing test cases have not been fixed by these
                   following changes and this is a notification to note that
                   these changes have not been fully tested by the CI system

Change summaries:
(Those commits are likely but not certainly responsible)

df1a09ba524d0f0927cd3e0a94fa223ae210912a by brooks:
libsys: expose a few more symbols for libc's use

ee632fb9eb4a060a4087a7f5425bfe36e65cda61 by brooks:
lib{c,sys}: normalize export of openat, setcontext, and swapcontext

26a09db3add30238b99e3214c56a3aee63fd71d1 by brooks:
Fix incremental build with WITH_NVME newly enabled

8ce3ef5f35fd4dc442b1a33605ca7d3132047faf by gbe:
netpfil: Fix typos in source code comments

046fe202e76623988ac612b20047940b86dd373f by gbe:
muge(4): Fix a typo in a source code comment

e991acd5d0f60fe3c57acb452003c551194a758b by gbe:
oce(4): Fix a typo in a source code comment

a01c7081fef671bd59e9a597883e4c1cd1f16ad5 by glebius:
vtnet: use CURVNET_SET() instead of CURVNET_SET_QUIET()

f7f570eb97c70bc7f545d79a96c3192181bb8dd1 by cy:
tools: Remove stray "then"

464b1ab216d5f78054626524addf99f5c622da96 by markj:
dumpon: fix set but not used variable

The failed test cases:

4 tests failed.
FAILED:  sys.netpfil.common.dummynet.pf_queue

Error Message:
We failed prioritisation 1 times

FAILED:  usr.bin.unzip.functional_test.test_I

Error Message:
atf-check failed; see the output of the test for details

FAILED:  sys.kern.unix_seqpacket_test.random_eor_and_waitall

Error Message:
/usr/src/tests/sys/kern/unix_seqpacket_test.c:1182: send(params->sock, &params->sendbuf[off], len, flags) == len not met

FAILED:  sys.netinet6.divert.ipdivert_ip6_output_remote_success

Error Message:
1 != 0 (1 != 0)