FreeBSD-main-amd64-test - Build #24221 - Still Unstable

From: <>
Date: Sat, 07 Oct 2023 17:02:35 UTC
FreeBSD-main-amd64-test - Build #24221 (abca3ae7734f664ee9c5edc7a9d3a17e29180bdb) - Still Unstable

Build information:
Full change log:
Full build log:

Status explanation:
"Unstable" - some tests are suspected being broken by the following changes
"Still Unstable" - the failing test cases have not been fixed by these
                   following changes and this is a notification to note that
                   these changes have not been fully tested by the CI system

Change summaries:
(Those commits are likely but not certainly responsible)

abca3ae7734f664ee9c5edc7a9d3a17e29180bdb by tuexen:
udp: fix sending of IPv4-mapped addresses

The failed test cases:

3 tests failed.
FAILED:  sys.netinet6.frag6.frag6_19.frag6_19

Error Message:
Global IPv6 statistics do not match: 19 != 20

FAILED:  usr.bin.file.file_test.contrib_file_tests

Error Message:
atf-check failed; see the output of the test for details

FAILED:  sys.fs.tmpfs.times_test.empty

Error Message:
Incorrect atime