FreeBSD-main-amd64-test - Build #24222 - Still Unstable

From: <>
Date: Sat, 07 Oct 2023 20:11:39 UTC
FreeBSD-main-amd64-test - Build #24222 (662ec2f781521c36b76af748d74bb0a3c2e27a76) - Still Unstable

Build information:
Full change log:
Full build log:

Status explanation:
"Unstable" - some tests are suspected being broken by the following changes
"Still Unstable" - the failing test cases have not been fixed by these
                   following changes and this is a notification to note that
                   these changes have not been fully tested by the CI system

Change summaries:
(Those commits are likely but not certainly responsible)

662ec2f781521c36b76af748d74bb0a3c2e27a76 by asomers:
fusefs: sanitize FUSE_READLINK results for embedded NULs

The failed test cases:

3 tests failed.
FAILED:  sys.netinet6.frag6.frag6_19.frag6_19

Error Message:
Global IPv6 statistics do not match: 19 != 20

FAILED:  usr.bin.file.file_test.contrib_file_tests

Error Message:
atf-check failed; see the output of the test for details

FAILED:  sys.fs.tmpfs.times_test.empty

Error Message:
Incorrect atime