FreeBSD-main-amd64-test - Build #24220 - Still Unstable

From: <>
Date: Sat, 07 Oct 2023 12:19:36 UTC
FreeBSD-main-amd64-test - Build #24220 (f7a2eeaa75dc95f2958d2db2170744f44e14b7ea) - Still Unstable

Build information:
Full change log:
Full build log:

Status explanation:
"Unstable" - some tests are suspected being broken by the following changes
"Still Unstable" - the failing test cases have not been fixed by these
                   following changes and this is a notification to note that
                   these changes have not been fully tested by the CI system

Change summaries:
(Those commits are likely but not certainly responsible)

f7a2eeaa75dc95f2958d2db2170744f44e14b7ea by emaste:
src.conf(5): regen after 166a655fcf13 (bsdinstall/libdialog)

The failed test cases:

3 tests failed.
FAILED:  sys.netinet6.frag6.frag6_19.frag6_19

Error Message:
Global IPv6 statistics do not match: 19 != 20

FAILED:  usr.bin.file.file_test.contrib_file_tests

Error Message:
atf-check failed; see the output of the test for details

FAILED:  sys.fs.tmpfs.times_test.empty

Error Message:
Incorrect atime