FreeBSD-main-amd64-test - Build #24219 - Still Unstable

From: <>
Date: Sat, 07 Oct 2023 10:23:10 UTC
FreeBSD-main-amd64-test - Build #24219 (4640df1b0a49697840b81f6bcd269a483514c6aa) - Still Unstable

Build information:
Full change log:
Full build log:

Status explanation:
"Unstable" - some tests are suspected being broken by the following changes
"Still Unstable" - the failing test cases have not been fixed by these
                   following changes and this is a notification to note that
                   these changes have not been fully tested by the CI system

Change summaries:
(Those commits are likely but not certainly responsible)

4640df1b0a49697840b81f6bcd269a483514c6aa by markj:
mrsas: Fix callout locking in mrsas_complete_cmd()

The failed test cases:

4 tests failed.

Error Message:
/usr/tests/atf_python/sys/net/ IndexError

FAILED:  sys.netinet6.frag6.frag6_19.frag6_19

Error Message:
Global IPv6 statistics do not match: 19 != 20

FAILED:  usr.bin.file.file_test.contrib_file_tests

Error Message:
atf-check failed; see the output of the test for details

FAILED:  sys.fs.tmpfs.times_test.empty

Error Message:
Incorrect atime