FreeBSD-main-amd64-test - Build #24442 - Still Unstable

From: <>
Date: Sat, 25 Nov 2023 21:15:29 UTC
FreeBSD-main-amd64-test - Build #24442 (ed88eef140a1c3d57d546f409c216806dd3da809) - Still Unstable

Build information:
Full change log:
Full build log:

Status explanation:
"Unstable" - some tests are suspected being broken by the following changes
"Still Unstable" - the failing test cases have not been fixed by these
                   following changes and this is a notification to note that
                   these changes have not been fully tested by the CI system

Change summaries:
(Those commits are likely but not certainly responsible)

ed88eef140a1c3d57d546f409c216806dd3da809 by jhb:
new-bus: Disable assertions for rman mismatches for activate/deactivate

The failed test cases:

3 tests failed.
FAILED:  bin.pwait.pwait_test.basic

Error Message:
atf-check failed; see the output of the test for details

FAILED:  sys.audit.administrative.auditctl_success

Error Message:
Test case cleanup timed out

FAILED:  sys.kqueue.proc3_test.proc3

Error Message:
/usr/src/contrib/netbsd-tests/kernel/kqueue/t_proc3.c:89: ke.fflags & NOTE_CHILD not met