FreeBSD-main-amd64-test - Build #24441 - Still Unstable

From: <>
Date: Sat, 25 Nov 2023 15:00:12 UTC
FreeBSD-main-amd64-test - Build #24441 (49a83b94395a6eaae4642aa72c9f6a40143f0f45) - Still Unstable

Build information:
Full change log:
Full build log:

Status explanation:
"Unstable" - some tests are suspected being broken by the following changes
"Still Unstable" - the failing test cases have not been fixed by these
                   following changes and this is a notification to note that
                   these changes have not been fully tested by the CI system

Change summaries:
(Those commits are likely but not certainly responsible)

49a83b94395a6eaae4642aa72c9f6a40143f0f45 by pho:
stress2: Do not make assumptions about the value of UFS_LINK_MAX

The failed test cases:

6 tests failed.
FAILED:  bin.pwait.pwait_test.or_flag

Error Message:
atf-check failed; see the output of the test for details


Error Message:
/usr/local/lib/python3.9/multiprocessing/ EOFError


Error Message:
Test case body returned a non-ok exit code, but this is not allowed

FAILED:  sys.audit.administrative.auditctl_success

Error Message:
Test case cleanup timed out

FAILED:  sys.kqueue.libkqueue.kqueue_test.main

Error Message:
Returned non-success exit status 1

FAILED:  sys.kqueue.proc3_test.proc3

Error Message:
/usr/src/contrib/netbsd-tests/kernel/kqueue/t_proc3.c:89: ke.fflags & NOTE_CHILD not met